{"text_format":"1","workbook":"xlsx","n_sheets":8,"sheets":["Property Info","Table 1","Table 2","Table 3","Table 4","777 Water","777 Soil","Organoleptics"],"not_rendered":{"charts":0,"images":0,"macros":1,"external_links":0,"defined_names":8,"comments":2,"pivot_tables":0},"unopened":[],"bounds":{"document_bytes":16777216,"sheet_cells":100000,"rows_first":2000,"rows_last":500,"rows_between":2000,"halvings":0,"cell_chars":16384,"cell_head_chars":4096},"cells_cut":0,"cells_raw":0,"read":"whole","date_system":"1900"}

{"sheet":"Property Info","index":0,"n_rows":33,"n_cols":10,"rows_kept":33,"cut":false,"hidden":false,"merged":[[0,0,0,9],[5,6,5,7],[5,8,5,9]]}
["Contamination Notification Data Collection - Off-site Property Information"]
[null,"Site Name"]
[null,"Site ID"]
[]
[]
["Property Map ID","Parcel ID","Property Name","Property Address","Property Owner Name","Property Owner Address","Groundwater",null,"Soil"]
["(A,B,C…)","(If known)","(If known)","(If known)","(If known)","(If known)","Confirmed","Suspected","Confirmed","Suspected"]
["A"]
["B"]
["C"]
["D"]
["E"]
["F"]
["G"]
["H"]
{"$rows_left_out":19}
{"sheet":"Table 1","index":1,"n_rows":37,"n_cols":18,"rows_kept":37,"cut":false,"hidden":false,"merged":[[0,0,0,11],[1,9,1,10],[2,9,2,10],[1,2,1,5],[2,2,2,5]]}
["Table 1 - Groundwater Data for Properties with Contaminated Wells"]
[null,"Site Name -",{"$f":"'Property Info'!C2","v":0},null,null,null,null,null,"Source of data - ","<report type & date>"]
[null,"Site ID",{"$f":"'Property Info'!C3","v":0},null,null,null,null,null,"Consultant Company Name - "]
[]
["Property ID","Property Name","Sample ID","Sample Type (DP, IW, MW, PW, O)*","Sample Date","Contaminant","Concentration","Health-Based CTL Value ","Health-Based CTL Exceeded","CTL Value Based on Nuisance, Organoleptic or Aesthetic Concerns","Nuisance, Organoleptic or Aesthetic CTL Exceeded","Source of Data\n(Report type & Date;\nApproved OR Not approved)"]
["(A,B,C…)","(if known)",null,null,null,"(Name)","(in µg/L)","(in µg/L)","(Yes or No)","(in µg/L)","(Yes or No)",null,null,null,null,null,"Sample Type"]
[null,{"$f":"IF(ISBLANK(A7),\"\",VLOOKUP(A7,'Property Info'!$A$8:$C$33,2,FALSE))","v":""},null,null,null,null,null,{"$f":"IF(ISBLANK(F7),\"\",VLOOKUP(F7,'777 Water'!$D$4:$J$542,6,FALSE))","v":""},{"$f":"IF(AND(ISNUMBER(G7),H7>0),IF(H7=\"Secondary\",\"-\",IF(G7>H7,\"Yes\",\"No\")),\"\")","v":""},{"$f":"IF(ISBLANK(F7),\"\",VLOOKUP(F7,'777 Water'!$D$4:$J$542,7,FALSE))","v":""},{"$f":"IF(AND(ISNUMBER(G7),J7>0),IF(J7=\"-\",J7,IF(G7>J7,\"Yes\",\"No\")),\"\")","v":""},null,null,null,null,2,"MW","Monitoring Well"]
[null,{"$f":"IF(ISBLANK(A8),\"\",VLOOKUP(A8,'Property Info'!$A$8:$C$33,2,FALSE))","v":""},null,null,null,null,null,{"$f":"IF(ISBLANK(F8),\"\",VLOOKUP(F8,'777 Water'!$D$4:$J$542,6,FALSE))","v":""},{"$f":"IF(AND(ISNUMBER(G8),H8>0),IF(H8=\"Secondary\",\"-\",IF(G8>H8,\"Yes\",\"No\")),\"\")","v":""},{"$f":"IF(ISBLANK(F8),\"\",VLOOKUP(F8,'777 Water'!$D$4:$J$542,7,FALSE))","v":""},{"$f":"IF(AND(ISNUMBER(G8),J8>0),IF(J8=\"-\",J8,IF(G8>J8,\"Yes\",\"No\")),\"\")","v":""},null,null,null,null,null,"DP","Direct Push"]
[null,{"$f":"IF(ISBLANK(A9),\"\",VLOOKUP(A9,'Property Info'!$A$8:$C$33,2,FALSE))","v":""},null,null,null,null,null,{"$f":"IF(ISBLANK(F9),\"\",VLOOKUP(F9,'777 Water'!$D$4:$J$542,6,FALSE))","v":""},{"$f":"IF(AND(ISNUMBER(G9),H9>0),IF(H9=\"Secondary\",\"-\",IF(G9>H9,\"Yes\",\"No\")),\"\")","v":""},{"$f":"IF(ISBLANK(F9),\"\",VLOOKUP(F9,'777 Water'!$D$4:$J$542,7,FALSE))","v":""},"",null,null,null,null,null,"IW","Irrigation Well"]
[null,{"$f":"IF(ISBLANK(A10),\"\",VLOOKUP(A10,'Property Info'!$A$8:$C$33,2,FALSE))","v":""},null,null,null,null,null,{"$f":"IF(ISBLANK(F10),\"\",VLOOKUP(F10,'777 Water'!$D$4:$J$542,6,FALSE))","v":""},{"$f":"IF(AND(ISNUMBER(G10),H10>0),IF(H10=\"Secondary\",\"-\",IF(G10>H10,\"Yes\",\"No\")),\"\")","v":""},{"$f":"IF(ISBLANK(F10),\"\",VLOOKUP(F10,'777 Water'!$D$4:$J$542,7,FALSE))","v":""},"",null,null,null,null,null,"PW","Potable Well"]
[null,{"$f":"IF(ISBLANK(A11),\"\",VLOOKUP(A11,'Property Info'!$A$8:$C$33,2,FALSE))","v":""},null,null,null,null,null,{"$f":"IF(ISBLANK(F11),\"\",VLOOKUP(F11,'777 Water'!$D$4:$J$542,6,FALSE))","v":""},{"$f":"IF(AND(ISNUMBER(G11),H11>0),IF(H11=\"Secondary\",\"-\",IF(G11>H11,\"Yes\",\"No\")),\"\")","v":""},{"$f":"IF(ISBLANK(F11),\"\",VLOOKUP(F11,'777 Water'!$D$4:$J$542,7,FALSE))","v":""},"",null,null,null,null,null,"Other","Other Sample Type"]
[null,{"$f":"IF(ISBLANK(A12),\"\",VLOOKUP(A12,'Property Info'!$A$8:$C$33,2,FALSE))","v":""},null,null,null,null,null,{"$f":"IF(ISBLANK(F12),\"\",VLOOKUP(F12,'777 Water'!$D$4:$J$542,6,FALSE))","v":""},{"$f":"IF(AND(ISNUMBER(G12),H12>0),IF(H12=\"Secondary\",\"-\",IF(G12>H12,\"Yes\",\"No\")),\"\")","v":""},{"$f":"IF(ISBLANK(F12),\"\",VLOOKUP(F12,'777 Water'!$D$4:$J$542,7,FALSE))","v":""},""]
[null,{"$f":"IF(ISBLANK(A13),\"\",VLOOKUP(A13,'Property Info'!$A$8:$C$33,2,FALSE))","v":""},null,null,null,null,null,{"$f":"IF(ISBLANK(F13),\"\",VLOOKUP(F13,'777 Water'!$D$4:$J$542,6,FALSE))","v":""},"",{"$f":"IF(ISBLANK(F13),\"\",VLOOKUP(F13,'777 Water'!$D$4:$J$542,7,FALSE))","v":""},""]
[null,{"$f":"IF(ISBLANK(A14),\"\",VLOOKUP(A14,'Property Info'!$A$8:$C$33,2,FALSE))","v":""},null,null,null,null,null,{"$f":"IF(ISBLANK(F14),\"\",VLOOKUP(F14,'777 Water'!$D$4:$J$542,6,FALSE))","v":""},"",{"$f":"IF(ISBLANK(F14),\"\",VLOOKUP(F14,'777 Water'!$D$4:$J$542,7,FALSE))","v":""},""]
[null,{"$f":"IF(ISBLANK(A15),\"\",VLOOKUP(A15,'Property Info'!$A$8:$C$33,2,FALSE))","v":""},null,null,null,null,null,{"$f":"IF(ISBLANK(F15),\"\",VLOOKUP(F15,'777 Water'!$D$4:$J$542,6,FALSE))","v":""},"",{"$f":"IF(ISBLANK(F15),\"\",VLOOKUP(F15,'777 Water'!$D$4:$J$542,7,FALSE))","v":""},""]
{"$rows_left_out":23}
{"sheet":"Table 2","index":2,"n_rows":37,"n_cols":18,"rows_kept":37,"cut":false,"hidden":false,"merged":[[2,2,2,5],[0,0,0,11],[1,2,1,5]]}
["Table 2 - Groundwater Data for Properties with No Wells"]
[null,"Site Name -",{"$f":"'Property Info'!C2","v":0}]
[null,"Site ID",{"$f":"'Property Info'!C3","v":0}]
[]
["Property ID","Property Name","Boundary Sample ID","Boundary Sample Type (DP, IW, MW, PW, O)*","Sample Date","Contaminant","Concentration","Health-Based CTL Value ","Health-Based CTL Exceeded","CTL Value Based on Nuisance, Organoleptic or Aesthetic Concerns","Nuisance, Organoleptic or Aesthetic CTL Exceeded","Source of Data\n(Report type & Date;\nApproved OR Not approved)"]
["(A,B,C…)","(if known)",null,null,null,"(Name)","(in µg/L)","(in µg/L)","(Yes or No)","(in µg/L)","(Yes or No)",null,null,null,null,null,"Sample Type"]
[null,{"$f":"IF(ISBLANK(A7),\"\",VLOOKUP(A7,'Property Info'!$A$8:$C$33,2,FALSE))","v":""},null,null,null,null,null,{"$f":"IF(ISBLANK(F7),\"\",VLOOKUP(F7,'777 Water'!$D$4:$J$542,6,FALSE))","v":""},{"$f":"IF(AND(ISNUMBER(G7),H7>0),IF(H7=\"Secondary\",\"-\",IF(G7>H7,\"Yes\",\"No\")),\"\")","v":""},{"$f":"IF(ISBLANK(F7),\"\",VLOOKUP(F7,'777 Water'!$D$4:$J$542,7,FALSE))","v":""},{"$f":"IF(AND(ISNUMBER(G7),J7>0),IF(J7=\"-\",J7,IF(G7>J7,\"Yes\",\"No\")),\"\")","v":""},null,null,null,null,2,"MW","Monitoring Well"]
[null,null,null,null,null,null,null,{"$f":"IF(ISBLANK(F8),\"\",VLOOKUP(F8,'777 Water'!$D$4:$J$542,6,FALSE))","v":""},{"$f":"IF(AND(ISNUMBER(G8),H8>0),IF(H8=\"Secondary\",\"-\",IF(G8>H8,\"Yes\",\"No\")),\"\")","v":""},{"$f":"IF(ISBLANK(F8),\"\",VLOOKUP(F8,'777 Water'!$D$4:$J$542,7,FALSE))","v":""},{"$f":"IF(AND(ISNUMBER(G8),J8>0),IF(J8=\"-\",J8,IF(G8>J8,\"Yes\",\"No\")),\"\")","v":""},null,null,null,null,null,"DP","Direct Push"]
[null,null,null,null,null,null,null,{"$f":"IF(ISBLANK(F9),\"\",VLOOKUP(F9,'777 Water'!$D$4:$J$542,6,FALSE))","v":""},{"$f":"IF(AND(ISNUMBER(G9),H9>0),IF(H9=\"Secondary\",\"-\",IF(G9>H9,\"Yes\",\"No\")),\"\")","v":""},{"$f":"IF(ISBLANK(F9),\"\",VLOOKUP(F9,'777 Water'!$D$4:$J$542,7,FALSE))","v":""},"",null,null,null,null,null,"IW","Irrigation Well"]
[null,null,null,null,null,null,null,{"$f":"IF(ISBLANK(F10),\"\",VLOOKUP(F10,'777 Water'!$D$4:$J$542,6,FALSE))","v":""},{"$f":"IF(AND(ISNUMBER(G10),H10>0),IF(H10=\"Secondary\",\"-\",IF(G10>H10,\"Yes\",\"No\")),\"\")","v":""},{"$f":"IF(ISBLANK(F10),\"\",VLOOKUP(F10,'777 Water'!$D$4:$J$542,7,FALSE))","v":""},"",null,null,null,null,null,"PW","Potable Well"]
[null,null,null,null,null,null,null,{"$f":"IF(ISBLANK(F11),\"\",VLOOKUP(F11,'777 Water'!$D$4:$J$542,6,FALSE))","v":""},{"$f":"IF(AND(ISNUMBER(G11),H11>0),IF(H11=\"Secondary\",\"-\",IF(G11>H11,\"Yes\",\"No\")),\"\")","v":""},{"$f":"IF(ISBLANK(F11),\"\",VLOOKUP(F11,'777 Water'!$D$4:$J$542,7,FALSE))","v":""},"",null,null,null,null,null,"Other","Other Sample Type"]
[null,null,null,null,null,null,null,{"$f":"IF(ISBLANK(F12),\"\",VLOOKUP(F12,'777 Water'!$D$4:$J$542,6,FALSE))","v":""},{"$f":"IF(AND(ISNUMBER(G12),H12>0),IF(H12=\"Secondary\",\"-\",IF(G12>H12,\"Yes\",\"No\")),\"\")","v":""},{"$f":"IF(ISBLANK(F12),\"\",VLOOKUP(F12,'777 Water'!$D$4:$J$542,7,FALSE))","v":""},""]
[null,null,null,null,null,null,null,{"$f":"IF(ISBLANK(F13),\"\",VLOOKUP(F13,'777 Water'!$D$4:$J$542,6,FALSE))","v":""},"",{"$f":"IF(ISBLANK(F13),\"\",VLOOKUP(F13,'777 Water'!$D$4:$J$542,7,FALSE))","v":""},""]
[null,null,null,null,null,null,null,{"$f":"IF(ISBLANK(F14),\"\",VLOOKUP(F14,'777 Water'!$D$4:$J$542,6,FALSE))","v":""},"",{"$f":"IF(ISBLANK(F14),\"\",VLOOKUP(F14,'777 Water'!$D$4:$J$542,7,FALSE))","v":""},""]
[null,null,null,null,null,null,null,{"$f":"IF(ISBLANK(F15),\"\",VLOOKUP(F15,'777 Water'!$D$4:$J$542,6,FALSE))","v":""},"",{"$f":"IF(ISBLANK(F15),\"\",VLOOKUP(F15,'777 Water'!$D$4:$J$542,7,FALSE))","v":""},""]
{"$rows_left_out":23}
{"sheet":"Table 3","index":3,"n_rows":31,"n_cols":13,"rows_kept":31,"cut":false,"hidden":false,"merged":[[0,0,0,12],[2,8,2,9],[3,8,3,9],[1,8,1,9],[1,2,1,5],[2,2,2,5]]}
["Table 3 - Soil Data for Properties with Contaminated Soil Samples"]
[null,"Site Name -",{"$f":"'Property Info'!C2","v":0},null,null,null,null,"Source of data - ","<report type & date>"]
[null,"Site ID",{"$f":"'Property Info'!C3","v":0},null,null,null,null,"Consultant Company Name-"]
[]
["Property ID","Property Name","Sample ID","Sample Date","Contaminant","Concentration\n0-2' BLS","Concentration\n>2' BLS","Residential Direct Exposure  CTL      ","Leachability Based on Groundwater Criteria CTL","Residential Direct Exposure Exceeded\n0-2' BLS","Residential Direct Exposure Exceeded\n>2' BLS","Leachability Exceeded","Source of Data\n(Report type & Date;\nApproved OR Not approved)"]
["(A,B,C…)","(if known)",null,null,"(Name)","(in mg/kg)","(in mg/kg)","(in mg/kg)","(in mg/kg)","(Yes or No)","(Yes or No)","(Yes or No)"]
[null,null,null,null,null,null,null,{"$f":"IF(ISBLANK(E7),\"\",VLOOKUP(E7,'777 Soil'!$D$4:$I$478,4,FALSE))","v":""},{"$f":"IF(ISBLANK(E7),\"\",VLOOKUP(E7,'777 Soil'!$D$4:$I$478,6,FALSE))","v":""},{"$f":"IF(AND(ISNUMBER(F7),H7>0),IF(F7>H7,\"Yes\",\"No\"),\"\")","v":""},{"$f":"IF(AND(ISNUMBER(G7),H7>0),IF(G7>H7,\"Yes\",\"No\"),\"\")","v":""},{"$f":"IF(AND(OR(ISNUMBER(F7),ISNUMBER(G7)),I7>0),IF(OR(AND(ISNUMBER(F7),F7>I7),AND(ISNUMBER(G7),G7>I7)),\"Yes\",\"No\"),\"\")","v":""}]
[null,null,null,null,null,null,null,{"$f":"IF(ISBLANK(E8),\"\",VLOOKUP(E8,'777 Soil'!$D$4:$I$478,4,FALSE))","v":""},{"$f":"IF(ISBLANK(E8),\"\",VLOOKUP(E8,'777 Soil'!$D$4:$I$478,6,FALSE))","v":""},"","",""]
[null,null,null,null,null,null,null,{"$f":"IF(ISBLANK(E9),\"\",VLOOKUP(E9,'777 Soil'!$D$4:$I$478,4,FALSE))","v":""},{"$f":"IF(ISBLANK(E9),\"\",VLOOKUP(E9,'777 Soil'!$D$4:$I$478,6,FALSE))","v":""},"","",""]
[null,null,null,null,null,null,null,{"$f":"IF(ISBLANK(E10),\"\",VLOOKUP(E10,'777 Soil'!$D$4:$I$478,4,FALSE))","v":""},{"$f":"IF(ISBLANK(E10),\"\",VLOOKUP(E10,'777 Soil'!$D$4:$I$478,6,FALSE))","v":""},"","",""]
[null,null,null,null,null,null,null,{"$f":"IF(ISBLANK(E11),\"\",VLOOKUP(E11,'777 Soil'!$D$4:$I$478,4,FALSE))","v":""},{"$f":"IF(ISBLANK(E11),\"\",VLOOKUP(E11,'777 Soil'!$D$4:$I$478,6,FALSE))","v":""},"","",""]
[null,null,null,null,null,null,null,{"$f":"IF(ISBLANK(E12),\"\",VLOOKUP(E12,'777 Soil'!$D$4:$I$478,4,FALSE))","v":""},{"$f":"IF(ISBLANK(E12),\"\",VLOOKUP(E12,'777 Soil'!$D$4:$I$478,6,FALSE))","v":""},"","",""]
[null,null,null,null,null,null,null,{"$f":"IF(ISBLANK(E13),\"\",VLOOKUP(E13,'777 Soil'!$D$4:$I$478,4,FALSE))","v":""},{"$f":"IF(ISBLANK(E13),\"\",VLOOKUP(E13,'777 Soil'!$D$4:$I$478,6,FALSE))","v":""},"","",""]
[null,null,null,null,null,null,null,{"$f":"IF(ISBLANK(E14),\"\",VLOOKUP(E14,'777 Soil'!$D$4:$I$478,4,FALSE))","v":""},{"$f":"IF(ISBLANK(E14),\"\",VLOOKUP(E14,'777 Soil'!$D$4:$I$478,6,FALSE))","v":""},"","",""]
[null,null,null,null,null,null,null,{"$f":"IF(ISBLANK(E15),\"\",VLOOKUP(E15,'777 Soil'!$D$4:$I$478,4,FALSE))","v":""},{"$f":"IF(ISBLANK(E15),\"\",VLOOKUP(E15,'777 Soil'!$D$4:$I$478,6,FALSE))","v":""},"","",""]
{"$rows_left_out":17}
{"sheet":"Table 4","index":4,"n_rows":32,"n_cols":13,"rows_kept":32,"cut":false,"hidden":false,"merged":[[3,8,3,9],[1,2,1,5],[2,2,2,5],[0,0,0,12]]}
["Table 4 - Soil Data for Properties with No Soil Samples"]
[null,"Site Name -",{"$f":"'Property Info'!C2","v":0}]
[null,"Site ID",{"$f":"'Property Info'!C3","v":0}]
[]
["Property ID","Property Name"," Boundary Sample ID","Sample Date","Contaminant","Concentration\n0-2' BLS","Concentration\n>2' BLS","Residential Direct Exposure  CTL      ","Leachability Based on Groundwater Criteria CTL","Residential Direct Exposure Exceeded\n0-2' BLS","Residential Direct Exposure Exceeded\n>2' BLS","Leachability Exceeded","Source of Data\n(Report type & Date;\nApproved OR Not approved)"]
["(A,B,C…)","(if known)",null,null,"(Name)","(in mg/kg)","(in mg/kg)","(in mg/kg)","(in mg/kg)","(Yes or No)","(Yes or No)","(Yes or No)"]
[null,{"$f":"IF(ISBLANK(A7),\"\",VLOOKUP(A7,'Property Info'!$A$8:$C$33,2,FALSE))","v":""},null,null,null,null,null,null,null,{"$f":"IF(AND(ISNUMBER(F7),H7>0),IF(F7>H7,\"Yes\",\"No\"),\"\")","v":""},{"$f":"IF(AND(ISNUMBER(G7),H7>0),IF(G7>H7,\"Yes\",\"No\"),\"\")","v":""},{"$f":"IF(AND(OR(ISNUMBER(F7),ISNUMBER(G7)),I7>0),IF(OR(AND(ISNUMBER(F7),F7>I7),AND(ISNUMBER(G7),G7>I7)),\"Yes\",\"No\"),\"\")","v":""}]
[null,null,null,null,null,null,null,{"$f":"IF(ISBLANK(E8),\"\",VLOOKUP(E8,'777 Soil'!$D$4:$I$478,4,FALSE))","v":""},{"$f":"IF(ISBLANK(E8),\"\",VLOOKUP(E8,'777 Soil'!$D$4:$I$478,6,FALSE))","v":""},"","",""]
[null,null,null,null,null,null,null,{"$f":"IF(ISBLANK(E9),\"\",VLOOKUP(E9,'777 Soil'!$D$4:$I$478,4,FALSE))","v":""},{"$f":"IF(ISBLANK(E9),\"\",VLOOKUP(E9,'777 Soil'!$D$4:$I$478,6,FALSE))","v":""},"","",""]
[null,null,null,null,null,null,null,{"$f":"IF(ISBLANK(E10),\"\",VLOOKUP(E10,'777 Soil'!$D$4:$I$478,4,FALSE))","v":""},{"$f":"IF(ISBLANK(E10),\"\",VLOOKUP(E10,'777 Soil'!$D$4:$I$478,6,FALSE))","v":""},"","",""]
[null,null,null,null,null,null,null,{"$f":"IF(ISBLANK(E11),\"\",VLOOKUP(E11,'777 Soil'!$D$4:$I$478,4,FALSE))","v":""},{"$f":"IF(ISBLANK(E11),\"\",VLOOKUP(E11,'777 Soil'!$D$4:$I$478,6,FALSE))","v":""},"","",""]
[null,null,null,null,null,null,null,{"$f":"IF(ISBLANK(E12),\"\",VLOOKUP(E12,'777 Soil'!$D$4:$I$478,4,FALSE))","v":""},{"$f":"IF(ISBLANK(E12),\"\",VLOOKUP(E12,'777 Soil'!$D$4:$I$478,6,FALSE))","v":""},"","",""]
[null,null,null,null,null,null,null,{"$f":"IF(ISBLANK(E13),\"\",VLOOKUP(E13,'777 Soil'!$D$4:$I$478,4,FALSE))","v":""},{"$f":"IF(ISBLANK(E13),\"\",VLOOKUP(E13,'777 Soil'!$D$4:$I$478,6,FALSE))","v":""},"","",""]
[null,null,null,null,null,null,null,{"$f":"IF(ISBLANK(E14),\"\",VLOOKUP(E14,'777 Soil'!$D$4:$I$478,4,FALSE))","v":""},{"$f":"IF(ISBLANK(E14),\"\",VLOOKUP(E14,'777 Soil'!$D$4:$I$478,6,FALSE))","v":""},"","",""]
[null,null,null,null,null,null,null,{"$f":"IF(ISBLANK(E15),\"\",VLOOKUP(E15,'777 Soil'!$D$4:$I$478,4,FALSE))","v":""},{"$f":"IF(ISBLANK(E15),\"\",VLOOKUP(E15,'777 Soil'!$D$4:$I$478,6,FALSE))","v":""},"","",""]
{"$rows_left_out":18}
{"sheet":"777 Water","index":5,"n_rows":564,"n_cols":23,"rows_kept":564,"cut":false,"hidden":false,"merged":[]}
[]
["HW Sort","Petrloleum Sort","Seq. Num.","Chemical","Groundwater Criteria","Notes","Health Based CTL (Lookup from Organoleptics tab)","Health Based CTL (Fill in missing values)","Health Based CTL","Orangoleptic or Secondary Standard","Freshwater Surface Water Criteria","Marine Surface Water Criteria","Groundwater of Low Yield/Poor Quality Criteria","Non-Cancer Target Organs/ Systems or Effects","CAS","Carcinogenic","Groundwater","Freshwater","Marine","Notes","Groundwater","Freshwater","Marine"]
[]
[1,null,485,"Tetrachloroethene  [or PCE]",3,"",{"$error":"#N/A"},{"$f":"IF(ISBLANK(E4),\"\",IF(ISNA(G4),E4,G4))","v":3},3,"-",8.85,8.85,30,"Liver ","127-18-4","Yes ","Primary Standard","62-302","62-302",null,"Carcinogen","annual average","annual average"]
[2,null,509,"Trichloroethene  [or TCE]",3,"",{"$error":"#N/A"},3,3,"-",80.7,80.7,30,"None Specified ",28861,"Yes ","Primary Standard","62-302","62-302",null,"Carcinogen","annual average","annual average"]
[3,null,192,"Dichloroethene, cis-1,2-",70,"",{"$error":"#N/A"},70,70,"-",null,null,700,"Blood ","156-59-2",null,"Primary Standard","NA","NA",null,"Systemic Toxicant"]
[4,null,193,"Dichloroethene, trans-1,2-",100,"",{"$error":"#N/A"},100,100,"-",11000,11000,1000,"Blood, Liver ","156-60-5",null,"Primary Standard","Toxicity Criteria","Toxicity Criteria",null,"Systemic Toxicant"]
[5,null,190,"Dichloroethene, 1,1-",7,"**",{"$error":"#N/A"},7,7,"-",3.2,3.2,70,"Liver ","75-35-4",null,"Primary Standard","62-302","62-302",null,"Carcinogen","annual average","annual average"]
[6,null,533,"Vinyl chloride",1,"",{"$error":"#N/A"},1,1,"-",2.4,2.4,10,"Liver ",27398,"Yes ","Primary Standard","Human Health","Human Health","(d)","Carcinogen"]
[7,null,188,"Dichloroethane, 1,1-",70,"**",{"$error":"#N/A"},70,70,"-",null,null,700,"Kidney ","75-34-3",null,"Minimum Criteria","NA","NA",null,"Systemic Toxicant"]
[8,null,31,"Arsenic",10,"",{"$error":"#N/A"},10,10,"-",50,50,100,"Cardiovascular, Skin ","NOCAS","Yes ","Primary Standard","62-302","62-302",null,"Carcinogen"]
[9,null,311,"Iron",300,"",4200,4200,4200,300,1000,300,3000,"Gastrointestinal ","7439-89-6",null,"Secondary Standard","62-302","62-302",null,"Aesthetic"]
[10,null,317,"Lead",15,"",{"$error":"#N/A"},15,15,"-",null,8.5,150,"Neurological ","7439-92-1",null,"Primary Standard","62-302","62-302",null,"Systemic Toxicant","f, g","g"]
[11,null,90,"Cadmium",5,"",{"$error":"#N/A"},5,5,"-",null,9.3000000000000007,50,"Kidney ","7440-43-9","Yes ","Primary Standard","62-302","62-302",null,"Carcinogen","f, g","g"]
[12,null,20,"Aluminum",200,"",7000,7000,7000,200,13,1500,2000,"Body Weight ","7429-90-5",null,"Secondary Standard","Toxicity Criteria","62-302",null,"Organoleptic"]
{"$rows_left_out":550}
{"sheet":"777 Soil","index":6,"n_rows":499,"n_cols":14,"rows_kept":499,"cut":false,"hidden":false,"merged":[]}
[]
["HW Sort","Petroleum Sort","Seq. Num.","Chemical","Target Organ/Systems or Effects","CAS#","Direct Exposure - Residential","Direct Exposure - Industrial","Leachability Based on Groundwater","Leachability Based on Freshwater SW","Leachability Based on Marine SW","Leachability based on GW of Low Yield/Poor Quality","Carcinogen","Additional Notes"]
[]
[1,null,26,"Arsenic","-Cardiovascular -Skin ","NOCAS",2.1,12,"***","***","***","***","-yes "]
[2,null,14,"Aldrin","-Liver ","309-00-2",0.06,0.3,0.2,0.01,0.01,2,"-yes "]
[3,null,94,"Chlordane (total)","-Liver ","(j)",2.8,14,9.6,3.0000000000000001E-3,3.0000000000000001E-3,96,"-yes "]
[4,null,189,"Dieldrin","-Liver ","60-57-1",0.06,0.3,2E-3,1E-4,1E-4,0.02,"-yes "]
[5,null,266,"Heptachlor epoxide","-Liver ","1024-57-3",0.1,0.5,0.6,1E-4,1E-4,6,"-yes "]
[6,10,40,"Benzo(a)pyrene",null,"50-32-8",0.1,0.7,8,"NA","NA",80,"-yes "]
[7,null,171,"Dichlorodiphenyltrichloroethane, p,p'-  [or DDT, 4,4'-]","-Liver ","50-29-3",2.9,15,11,0.06,0.06,110,"-yes "]
[8,11,39,"Benzo(a)anthracene",null,"56-55-3","#","#",0.8,"NA","NA",8,"-yes "]
[9,12,41,"Benzo(b)fluoranthene",null,"205-99-2","#","#",2.4,"NA","NA",24,"-yes "]
[10,null,270,"Hexachlorocyclohexane, beta-  [BHC, beta-]",null,"319-85-7",0.5,2.4,1E-3,3.0000000000000001E-3,3.0000000000000001E-3,0.01,"-yes "]
[11,null,125,"Chromium (total)",null,"NOCAS",210,470,38,4.2,19,380,"-yes ","(b,g)"]
[12,null,129,"Copper","-Gastrointestinal ","7440-50-8","150**",89000,"***","NA","***","***"]
{"$rows_left_out":485}
{"sheet":"Organoleptics","index":7,"n_rows":49,"n_cols":7,"rows_kept":49,"cut":false,"hidden":false,"merged":[]}
[null,"Table A from 785"]
["777 Water Table Cross Reference)","Contaminant","CAS#","Chapter 62-777, F.A.C. (ug/L)","Based on","Health-Based GCTL (ug/L)","Target Organ/System or Effect"]
[{"$f":"VLOOKUP(B3,WaterCOCs,1,FALSE)","v":"Acenaphthene"},"Acenaphthene","83-32-9",20,"Organoleptic",420,"-Liver"]
[{"$f":"VLOOKUP(B4,WaterCOCs,1,FALSE)","v":"Aluminum"},"Aluminum","7429-90-5",200,"Secondary Standard",7000,"-Body Weight"]
["Biphenyl, 1,1-  [or Diphenyl]","Biphenyl, 1,1-  [or Diphenyl]","92-52-4",0.5,"Organoleptic",350,"-Kidney"]
["Butyl acetate, n-","Butyl acetate, n-","123-86-4",43,"Organoleptic","NA","-None Specified"]
["Chloride","Chloride","16887-00-6",250000,"Secondary Standard","NA","-None Specified"]
["Chlorophenol, 3-","Chlorophenol, 3-","108-43-0",0.1,"Organoleptic",35,"-Reproductive"]
["Chlorophenol, 4-","Chlorophenol, 4-","106-48-9",0.1,"Organoleptic",35,"- Reproductive"]
["Chloropicrin","Chloropicrin",27913,7.3,"Organoleptic","NA","-None Specified"]
["Copper","Copper","7440-50-8",1000,"Secondary Standard","280(a)","-Gastrointestinal"]
["Cumene  [or Isopropyl benzene]","Cumene  [or Isopropyl benzene]","98-82-8",0.8,"Organoleptic",700,"-Adrenals -Kidney"]
["Dichlorophenol, 2,3-","Dichlorophenol, 2,3-","576-24-9",0.04,"Organoleptic",21,"- Immunological"]
["Dichlorophenol, 2,4-","Dichlorophenol, 2,4-","120-83-2",0.3,"Organoleptic",21,"-Immunological"]
["Dichlorophenol, 2,5-","Dichlorophenol, 2,5-","583-78-8",0.5,"Organoleptic",21,"- Immunological"]
{"$rows_left_out":34}