{"text_format":"1","workbook":"xlsx","n_sheets":4,"sheets":["Instructions","Rate Change Requests","Rates","Lookups"],"not_rendered":{"charts":0,"images":1,"macros":1,"external_links":0,"defined_names":8,"comments":0,"pivot_tables":0},"unopened":[],"bounds":{"document_bytes":16777216,"sheet_cells":100000,"rows_first":2000,"rows_last":500,"rows_between":2000,"halvings":0,"cell_chars":16384,"cell_head_chars":4096},"cells_cut":0,"cells_raw":0,"read":"whole","date_system":"1900"}

{"sheet":"Instructions","index":0,"n_rows":22,"n_cols":4,"rows_kept":22,"cut":false,"hidden":false,"merged":[[6,3,6,5],[17,1,17,2],[15,1,15,2],[10,3,10,5],[11,3,11,5],[22,1,22,5],[1,1,1,5],[14,3,15,5],[17,3,17,5],[19,3,19,5],[20,3,20,5],[16,2,16,5],[2,1,2,5],[18,2,18,5],[3,2,3,5],[4,2,4,5],[5,2,5,5],[12,3,13,5],[7,2,7,5],[9,2,9,5],[8,3,8,5]]}
[]
[]
[null,"Instructions for 2022 Rate Change Requests"]
[null,"1. ","Access the Rate Change Requests tab."]
[null,"2. ","Enter the Contract Number (starting with \"GC\") at the top."]
[null,"3. ","Edit Contractor Name, if necessary."]
[null,null,"▪","Editing the displayed contractor name will disable the auto-lookup function."]
[null,"4. ","Click 'Lock Cells' to lock in Contract Number and current rates (Column E) as displayed."]
[null,null,"▪","Requested rates cannot be entered until the Contract number is locked in."]
[null,"5. ","Enter the requested rates in Column F."]
[null,null,"▪","Increase requests greater than 15% are not allowed."]
[null,null,"▪","New rates must be entered with two (2) decimal places, as currency."]
[null,null,"▪","All rate increases must include entry of rate increase justification in Column I. Justification must be relevant to the pay item description."]
[]
[null,null,"▪","Only enter a rate if requesting a change (increase or decrease). Do not enter a requested rate amount that is the same as the current rate."]
{"$rows_left_out":8}
{"sheet":"Rate Change Requests","index":1,"n_rows":467,"n_cols":12,"rows_kept":467,"cut":false,"hidden":false,"merged":[[3,0,3,1],[2,0,2,1],[1,0,1,1],[4,0,4,1],[465,1,465,2],[459,1,459,2],[460,1,460,2],[461,1,461,2],[462,1,462,2],[463,1,463,2],[464,1,464,2],[453,1,453,2],[454,1,454,2],[455,1,455,2],[456,1,456,2],[457,1,457,2],[458,1,458,2],[447,1,447,2],[448,1,448,2],[449,1,449,2],[450,1,450,2],[451,1,451,2],[452,1,452,2],[441,1,441,2],[442,1,442,2],[443,1,443,2],[444,1,444,2],[445,1,445,2],[446,1,446,2],[435,1,435,2],[436,1,436,2],[437,1,437,2],[438,1,438,2],[439,1,439,2],[440,1,440,2],[429,1,429,2],[430,1,430,2],[431,1,431,2],[432,1,432,2],[433,1,433,2],[434,1,434,2],[422,1,422,2],[423,1,423,2],[424,1,424,2],[425,1,425,2],[427,1,427,2],[428,1,428,2],[416,1,416,2],[417,1,417,2],[418,1,418,2],[419,1,419,2],[420,1,420,2],[421,1,421,2],[409,1,409,2],[410,1,410,2],[411,1,411,2],[412,1,412,2],[413,1,413,2],[415,1,415,2],[403,1,403,2],[404,1,404,2],[405,1,405,2],[406,1,406,2],[407,1,407,2],[408,1,408,2],[397,1,397,2],[398,1,398,2],[399,1,399,2],[400,1,400,2],[401,1,401,2],[402,1,402,2],[391,1,391,2],[392,1,392,2],[393,1,393,2],[394,1,394,2],[395,1,395,2],[396,1,396,2],[384,1,384,2],[385,1,385,2],[386,1,386,2],[388,1,388,2],[389,1,389,2],[390,1,390,2],[378,1,378,2],[379,1,379,2],[380,1,380,2],[381,1,381,2],[382,1,382,2],[383,1,383,2],[372,1,372,2],[373,1,373,2],[374,1,374,2],[375,1,375,2],[376,1,376,2],[377,1,377,2],[366,1,366,2],[367,1,367,2],[368,1,368,2],[369,1,369,2],[370,1,370,2],[371,1,371,2],[360,1,360,2],[361,1,361,2],[362,1,362,2],[363,1,363,2],[364,1,364,2],[365,1,365,2],[354,1,354,2],[355,1,355,2],[356,1,356,2],[357,1,357,2],[358,1,358,2],[359,1,359,2],[348,1,348,2],[349,1,349,2],[350,1,350,2],[351,1,351,2],[352,1,352,2],[353,1,353,2],[342,1,342,2],[343,1,343,2],[344,1,344,2],[345,1,345,2],[346,1,346,2],[347,1,347,2],[336,1,336,2],[337,1,337,2],[338,1,338,2],[339,1,339,2],[340,1,340,2],[341,1,341,2],[330,1,330,2],[331,1,331,2],[332,1,332,2],[333,1,333,2],[334,1,334,2],[335,1,335,2],[323,1,323,2],[324,1,324,2],[325,1,325,2],[326,1,326,2],[327,1,327,2],[329,1,329,2],[316,1,316,2],[317,1,317,2],[318,1,318,2],[319,1,319,2],[320,1,320,2],[321,1,321,2],[310,1,310,2],[311,1,311,2],[312,1,312,2],[313,1,313,2],[314,1,314,2],[315,1,315,2],[303,1,303,2],[304,1,304,2],[305,1,305,2],[306,1,306,2],[307,1,307,2],[308,1,308,2],[297,1,297,2],[298,1,298,2],[299,1,299,2],[300,1,300,2],[301,1,301,2],[302,1,302,2],[289,1,289,2],[290,1,290,2],[291,1,291,2],[292,1,292,2],[295,1,295,2],[296,1,296,2],[283,1,283,2],[284,1,284,2],[285,1,285,2],[286,1,286,2],[287,1,287,2],[288,1,288,2],[277,1,277,2],[278,1,278,2],[279,1,279,2],[280,1,280,2],[281,1,281,2],[282,1,282,2],[271,1,271,2],[272,1,272,2],[273,1,273,2],[274,1,274,2],[275,1,275,2],[276,1,276,2],[265,1,265,2],[266,1,266,2],[267,1,267,2],[268,1,268,2],[269,1,269,2],[270,1,270,2],[259,1,259,2],[260,1,260,2],[261,1,261,2],[262,1,262,2],[263,1,263,2],[264,1,264,2],[253,1,253,2],[254,1,254,2],[255,1,255,2],[256,1,256,2],[257,1,257,2],[258,1,258,2],[247,1,247,2],[248,1,248,2],[249,1,249,2],[250,1,250,2],[251,1,251,2],[252,1,252,2],[241,1,241,2],[242,1,242,2],[243,1,243,2],[244,1,244,2],[245,1,245,2],[246,1,246,2],[235,1,235,2],[236,1,236,2],[237,1,237,2],[238,1,238,2],[239,1,239,2],[240,1,240,2],[229,1,229,2],[230,1,230,2],[231,1,231,2],[232,1,232,2],[233,1,233,2],[234,1,234,2],[223,1,223,2],[224,1,224,2],[225,1,225,2],[226,1,226,2],[227,1,227,2],[228,1,228,2],[217,1,217,2],[218,1,218,2],[219,1,219,2],[220,1,220,2],[221,1,221,2],[222,1,222,2],[211,1,211,2],[212,1,212,2],[213,1,213,2],[214,1,214,2],[215,1,215,2],[216,1,216,2],[205,1,205,2],[206,1,206,2],[207,1,207,2],[208,1,208,2],[209,1,209,2],[210,1,210,2],[199,1,199,2],[200,1,200,2],[201,1,201,2],[202,1,202,2],[203,1,203,2],[204,1,204,2],[193,1,193,2],[194,1,194,2],[195,1,195,2],[196,1,196,2],[197,1,197,2],[198,1,198,2],[187,1,187,2],[188,1,188,2],[189,1,189,2],[190,1,190,2],[191,1,191,2],[192,1,192,2],[181,1,181,2],[182,1,182,2],[183,1,183,2],[184,1,184,2],[185,1,185,2],[186,1,186,2],[175,1,175,2],[176,1,176,2],[177,1,177,2],[178,1,178,2],[179,1,179,2],[180,1,180,2],[169,1,169,2],[170,1,170,2],[171,1,171,2],[172,1,172,2],[173,1,173,2],[174,1,174,2],[163,1,163,2],[164,1,164,2],[165,1,165,2],[166,1,166,2],[167,1,167,2],[168,1,168,2],[157,1,157,2],[158,1,158,2],[159,1,159,2],[160,1,160,2],[161,1,161,2],[162,1,162,2],[151,1,151,2],[152,1,152,2],[153,1,153,2],[154,1,154,2],[155,1,155,2],[156,1,156,2],[145,1,145,2],[146,1,146,2],[147,1,147,2],[148,1,148,2],[149,1,149,2],[150,1,150,2],[139,1,139,2],[140,1,140,2],[141,1,141,2],[142,1,142,2],[143,1,143,2],[144,1,144,2],[133,1,133,2],[134,1,134,2],[135,1,135,2],[136,1,136,2],[137,1,137,2],[138,1,138,2],[127,1,127,2],[128,1,128,2],[129,1,129,2],[130,1,130,2],[131,1,131,2],[132,1,132,2],[121,1,121,2],[122,1,122,2],[123,1,123,2],[124,1,124,2],[125,1,125,2],[126,1,126,2],[115,1,115,2],[116,1,116,2],[117,1,117,2],[118,1,118,2],[119,1,119,2],[120,1,120,2],[109,1,109,2],[110,1,110,2],[111,1,111,2],[112,1,112,2],[113,1,113,2],[114,1,114,2],[103,1,103,2],[104,1,104,2],[105,1,105,2],[106,1,106,2],[107,1,107,2],[108,1,108,2],[97,1,97,2],[98,1,98,2],[99,1,99,2],[100,1,100,2],[101,1,101,2],[102,1,102,2],[91,1,91,2],[92,1,92,2],[93,1,93,2],[94,1,94,2],[95,1,95,2],[96,1,96,2],[85,1,85,2],[86,1,86,2],[87,1,87,2],[88,1,88,2],[89,1,89,2],[90,1,90,2],[79,1,79,2],[80,1,80,2],[81,1,81,2],[82,1,82,2],[83,1,83,2],[84,1,84,2],[73,1,73,2],[74,1,74,2],[75,1,75,2],[76,1,76,2],[77,1,77,2],[78,1,78,2],[67,1,67,2],[68,1,68,2],[69,1,69,2],[70,1,70,2],[71,1,71,2],[72,1,72,2],[61,1,61,2],[62,1,62,2],[63,1,63,2],[64,1,64,2],[65,1,65,2],[66,1,66,2],[55,1,55,2],[56,1,56,2],[57,1,57,2],[58,1,58,2],[59,1,59,2],[60,1,60,2],[49,1,49,2],[50,1,50,2],[51,1,51,2],[52,1,52,2],[53,1,53,2],[54,1,54,2],[43,1,43,2],[44,1,44,2],[45,1,45,2],[46,1,46,2],[47,1,47,2],[48,1,48,2],[37,1,37,2],[38,1,38,2],[39,1,39,2],[40,1,40,2],[41,1,41,2],[42,1,42,2],[31,1,31,2],[32,1,32,2],[33,1,33,2],[34,1,34,2],[35,1,35,2],[36,1,36,2],[25,1,25,2],[26,1,26,2],[27,1,27,2],[28,1,28,2],[29,1,29,2],[30,1,30,2],[20,1,20,2],[21,1,21,2],[22,1,22,2],[23,1,23,2],[24,1,24,2],[6,1,6,2],[19,1,19,2],[13,1,13,2],[14,1,14,2],[15,1,15,2],[16,1,16,2],[17,1,17,2],[18,1,18,2],[7,1,7,2],[8,1,8,2],[9,1,9,2],[10,1,10,2],[11,1,11,2],[12,1,12,2]]}
[]
["Contract #:"]
["Region:",null,{"$f":"IF($C$2<>\"\", VLOOKUP($C$2,Lookups!$A$2:$D$132,2,FALSE), \"\")","v":""}]
["CID#:",null,{"$f":"IF($C$2<>\"\", VLOOKUP($C$2,Lookups!$A$2:$D$132,3,FALSE), \"\")","v":""}]
["Contractor Name:",null,{"$f":"IF($C$2<>\"\", VLOOKUP($C$2,Lookups!$A$2:$D$132,4,FALSE), \"\")","v":""}]
[null,""]
["PAY ITEM","DESCRIPTION                          ",null,"UNIT OF MEASURE","CONTRACTED ITEM PRICE","ATC REQUESTED ITEM PRICE","PERCENT CHANGE","CURRENT RATE PERCENTILE","NEGOTIATED RATE","JUSTIFICATION FOR INCREASE (required for all increases)",null,"Unlock?"]
["1.","OFFICE ACTIVITIES",null,null,null,null,null,null,null,null,null,"N"]
["1-1.","File Review",null,"Per Review",{"$f":"IF($C$2<>\"\", VLOOKUP($A9,Rates!$A$1:$EB$430,MATCH($C$2,Rates!$A$1:$EB$1,0),FALSE), \"\")","v":""},null,{"$f":"IF(AND(F9<>\"\",E9<>\"\"), (F9-E9)/E9, \"\")","v":""},{"$f":"IF($E9<>\"\", (_xlfn.PERCENTRANK.INC(INDEX(Rates!$B$1:$EB$430,MATCH($A9, Rates!$A$1:$A$430, 0),0), $E9, 2)*100), \"\")","v":""},{"$f":"IF(AND(E9<>\"\",F9<>\"\" ), IF(AND(H9>75,G9>0), E9, ROUND(F9,2)), \"\")","v":""},null,null,"Y"]
["1-2.","Site Health & Safety Plan",null,"Per Site",{"$f":"IF($C$2<>\"\", VLOOKUP($A10,Rates!$A$1:$EB$430,MATCH($C$2,Rates!$A$1:$EB$1,0),FALSE), \"\")","v":""},null,{"$f":"IF(AND(F10<>\"\",E10<>\"\"), (F10-E10)/E10, \"\")","v":""},{"$f":"IF($E10<>\"\", (_xlfn.PERCENTRANK.INC(INDEX(Rates!$B$1:$EB$430,MATCH($A10, Rates!$A$1:$A$430, 0),0), $E10, 2)*100), \"\")","v":""},{"$f":"IF(AND(E10<>\"\",F10<>\"\" ), IF(AND(H10>75,G10>0), E10, ROUND(F10,2)), \"\")","v":""},null,null,"Y"]
["1-2.a.","Site Health & Safety Plan for Continued Work (no cost to FDEP)",null,"Per Site",{"$f":"IF($C$2<>\"\", VLOOKUP($A11,Rates!$A$1:$EB$430,MATCH($C$2,Rates!$A$1:$EB$1,0),FALSE), \"\")","v":""},{"$f":"IF($C$2<>\"\", \"n/a\", \"\")","v":""},{"$f":"IF($C$2<>\"\", \"n/a\", \"\")","v":""},{"$f":"IF($C$2<>\"\", \"n/a\", \"\")","v":""},{"$f":"IF($C$2<>\"\", \"n/a\", \"\")","v":""},{"$f":"IF($C$2<>\"\", \"n/a\", \"\")","v":""},null,"N"]
["1-3.","Notice of Discovery of Contamination Package (Initial or TPOC)",null,"Per Package",{"$f":"IF($C$2<>\"\", VLOOKUP($A12,Rates!$A$1:$EB$430,MATCH($C$2,Rates!$A$1:$EB$1,0),FALSE), \"\")","v":""},null,"",{"$f":"IF($E12<>\"\", (_xlfn.PERCENTRANK.INC(INDEX(Rates!$B$1:$EB$430,MATCH($A12, Rates!$A$1:$A$430, 0),0), $E12, 2)*100), \"\")","v":""},"",null,null,"Y"]
["1-4.","Permit Fees (actual fee only, cost to obtain permit is included in applicable pay items)",null,"Reimbursable*",{"$f":"IF($C$2<>\"\", VLOOKUP($A13,Rates!$A$1:$EB$430,MATCH($C$2,Rates!$A$1:$EB$1,0),FALSE), \"\")","v":""},{"$f":"IF($C$2<>\"\", \"n/a\", \"\")","v":""},"","","",{"$f":"IF($C$2<>\"\", \"n/a\", \"\")","v":""},null,"N"]
["1-5.","Off-Site Property Access Agreement",null,"Per Agreement",{"$f":"IF($C$2<>\"\", VLOOKUP($A14,Rates!$A$1:$EB$430,MATCH($C$2,Rates!$A$1:$EB$1,0),FALSE), \"\")","v":""},null,"",{"$f":"IF($E14<>\"\", (_xlfn.PERCENTRANK.INC(INDEX(Rates!$B$1:$EB$430,MATCH($A14, Rates!$A$1:$A$430, 0),0), $E14, 2)*100), \"\")","v":""},"",null,null,"Y"]
["1-5.a.","Site Property Access Agreement for Source Property (no cost to FDEP)",null,"Per Agreement",{"$f":"IF($C$2<>\"\", VLOOKUP($A15,Rates!$A$1:$EB$430,MATCH($C$2,Rates!$A$1:$EB$1,0),FALSE), \"\")","v":""},{"$f":"IF($C$2<>\"\", \"n/a\", \"\")","v":""},"","","",{"$f":"IF($C$2<>\"\", \"n/a\", \"\")","v":""},null,"N"]
{"$rows_left_out":453}
{"sheet":"Rates","index":2,"n_rows":430,"n_cols":132,"rows_kept":430,"cut":false,"hidden":true,"merged":[]}
["PAY\nITEM","GC728","GC729","GC730","GC731","GC732","GC733","GC734","GC735","GC737","GC738","GC739","GC741","GC742","GC743","GC745","GC746","GC748","GC749","GC750","GC751","GC752","GC753","GC755","GC757","GC758","GC759","GC761","GC762","GC763","GC764","GC765","GC766","GC768","GC769","GC770","GC771","GC772","GC773","GC774","GC776","GC777","GC778","GC779","GC781","GC783","GC784","GC785","GC786","GC787","GC788","GC789","GC790","GC792","GC793","GC794","GC796","GC797","GC798","GC799","GC800","GC801","GC802","GC805","GC806","GC807","GC808","GC809","GC810","GC811","GC812","GC813","GC814","GC815","GC816","GC817","GC818","GC820","GC821","GC822","GC823","GC824","GC825","GC827","GC828","GC829","GC831","GC832","GC833","GC834","GC835","GC836","GC837","GC838","GC839","GC840","GC842","GC843","GC844","GC846","GC847","GC848","GC849","GC850","GC851","GC853","GC854","GC855","GC857","GC858","GC859","GC860","GC861","GC862","GC863","GC864","GC866","GC867","GC868","GC870","GC871","GC873","GC874","GC875","GC876","GC877","GC879","GC880","GC881","GC883","GC885","GC887"]
["1-1.",525,620.22,636.20000000000005,577,630,500,478.59,105,578.76,550,367.5,600,604.48,633.92999999999995,505,600,483.5,551.25,493,461.88,491.98,625,500,115.76,631.4,433,430,587.47,608.02,576.75,636.20000000000005,532.35,500,551.25,630,613.45000000000005,559.91,500,551.25,600,630,600,576,500,535,400,525,620.22,636.20000000000005,577,478.59,105,551.25,500,393.75,409,600,604.48,633.92999999999995,300,505,600,486,551.25,518,600,640,610,631.4,515,630,430,587.47,636.20000000000005,601.65,614.34,551.25,642.54999999999995,613.44000000000005,550,630,600,605,633.92999999999995,500,400,500,525,620.22,636.20000000000005,565,472.5,550,500,478.59,578.80999999999995,630,367.5,600,604.48,633.92999999999995,300,505,600,486,461.88,551.25,500,518,625,640,105,115.76,631.4,525,430,587.47,607.69000000000005,601.65,603.75,551.25,625.54,630,613.45000000000005,550,600,630,600,576,500,535]
["1-2.",211.05,368.6,372.81,300,370,350,313,105,324.13,335,210,300,338.35,358.31,300,370,241.5,165.37,300,269.41000000000003,289.39999999999998,380,250,115.76,370,350,120,373.66,381,315.19,372.81,202.57,262,324.13,370,312.97000000000003,342.03,350,267.39999999999998,350,372,350,230.5,262,262.5,345,211.05,368.6,372.81,300,317.54000000000002,105,308.7,305.89999999999998,214,273,300,338.35,376.22,200,300,370,181,165.37,305,365,325,367.51,388.5,350,375,120,373.66,372.81,292.95,372.25,324.13,370,312.95,350,375,350,231,375,262,345,300,211.05,368.6,372.81,308,367.5,250,350,314.5,324.10000000000002,375,210,300,338.35,376.21,200,300,370,181,269.41000000000003,165.37,250,320,380,325,105,115.76,375,350,120,373.66,381,292.95,367.5,324.13,649.87,370,312.97000000000003,350,350,372,400,231,262,262.5]
["1-2.A.",0,0,0,0,0,0,0,0,0,0,0,0,0,0,0,0,0,0,0,0,0,0,0,0,0,0,0,0,0,0,0,0,0,0,0,0,0,0,0,0,0,0,0,0,0,0,0,0,0,0,0,0,0,0,0,0,0,0,0,0,0,0,0,0,0,0,0,0,0,0,0,0,0,0,0,0,0,0,0,0,0,0,0,0,0,0,0,0,0,0,0,0,0,0,0,0,0,0,0,0,0,0,0,0,0,0,0,0,0,0,0,0,0,0,0,0,0,0,0,0,0,0,0,0,0,0,0,0,0,0,0]
["1-3.",304.5,311.07,295.27,300,295,275,296.10000000000002,250,303.18,285,262.5,300,277.75,275.62,290,315,272,262.5,245,291.41000000000003,260.45999999999998,280,295,115.76,340,300,315,286.18,315.91000000000003,281.45,310,262.5,275,255.78,313.13,324.13,244.5,280,277.75,305,315.94,300,230.5,285,260,290,329.87,311.07,295.27,300,299.52999999999997,250,303.18,335,274.44,273,300,277.75,303.87,225,290,315,273,262.5,245,280,245,315.75,340.9,300,315,325,286.18,310.02999999999997,281,313.45,255.78,313.13,324.10000000000002,280,327.45,300,231,315,285,290,250,329.87,311.07,295.27,300,294,250,275,296.62,318.31,315,262.5,300,277.75,303.87,225,290,315,260.45999999999998,291.41000000000003,262.5,295,245,280,245,250,115.76,340.9,300,310.8,311.23,315.85000000000002,295.05,295.27,255.78,324.98,313.13,324.13,280,305,315.93,325,231,285,260]
["1-4.",1,1,1,1,1,1,1,1,1,1,1,1,1,1,1,1,1,1,1,1,1,1,1,1,1,1,1,1,1,1,1,1,1,1,1,1,1,1,1,1,1,1,1,1,1,1,1,1,1,1,1,1,1,1,1,1,1,1,1,1,1,1,1,1,1,1,1,1,1,1,1,1,1,1,1,1,1,1,1,1,1,1,1,1,1,1,1,1,1,1,1,1,1,1,1,1,1,1,1,1,1,1,1,1,1,1,1,1,1,1,1,1,1,1,1,1,1,1,1,1,1,1,1,1,1,1,1,1,1,1,1]
["1-5.",385.87,481.37,398.47,330,220.5,400,255.24,250,337.8,450,198.45,400,379.12,303.87,360,500,241.5,115.76,288,346.41,231.52,375,300,115.76,500,380,410,535.88,475,347.4,475,330.75,300,288.85000000000002,380.21,344.57,499.23,315,347.28,500,267.38,367.5,399,355,157.5,350,385.87,481.37,398.47,330,255.24,250,347.28,350,202.38,378,400,379.12,303.87,200,360,500,243,115.76,302,370,500,327.96,538.79,371.17,450,410,535.88,475,355.95,427.9,288.85000000000002,380.23,344.57,315,267.33,250,399,385.87,355,350,147,385.87,428.42,398.47,315,315,350,400,255.24,346.95,275.62,198.45,400,379.12,303.87,200,360,500,243,346.41,115.76,300,302,375,500,250,115.76,500,380,410,535.88,475,355.95,473,288.85000000000002,292.39999999999998,380.21,344.57,315,500,267.33,380,399,355,157.5]
["1-5.A.",0,0,0,0,0,0,0,0,0,0,0,0,0,0,0,0,0,0,0,0,0,0,0,0,0,0,0,0,0,0,0,0,0,0,0,0,0,0,0,0,0,0,0,0,0,0,0,0,0,0,0,0,0,0,0,0,0,0,0,0,0,0,0,0,0,0,0,0,0,0,0,0,0,0,0,0,0,0,0,0,0,0,0,0,0,0,0,0,0,0,0,0,0,0,0,0,0,0,0,0,0,0,0,0,0,0,0,0,0,0,0,0,0,0,0,0,0,0,0,0,0,0,0,0,0,0,0,0,0,0,0]
["1-6.",1,1,1,1,1,1,1,1,1,1,1,1,1,1,1,1,1,1,1,1,1,1,1,1,1,1,1,1,1,1,1,1,1,1,1,1,1,1,1,1,1,1,1,1,1,1,1,1,1,1,1,1,1,1,1,1,1,1,1,1,1,1,1,1,1,1,1,1,1,1,1,1,1,1,1,1,1,1,1,1,1,1,1,1,1,1,1,1,1,1,1,1,1,1,1,1,1,1,1,1,1,1,1,1,1,1,1,1,1,1,1,1,1,1,1,1,1,1,1,1,1,1,1,1,1,1,1,1,1,1,1]
["1-7.",0.06,0.06,0.06,0.06,0.06,0.06,0.06,0.06,0.06,0.06,0.06,0.06,0.06,0.06,0.06,0.06,0.06,0.06,0.06,0.06,0.06,0.06,0.06,0.06,0.06,0.06,0.06,0.06,0.06,0.06,0.06,0.06,0.06,0.06,0.06,0.06,0.06,0.06,0.06,0.06,0.06,0.06,0.06,0.06,0.06,0.06,0.06,0.06,0.06,0.06,0.06,0.06,0.06,0.06,0.06,0.06,0.06,0.06,0.06,0.06,0.06,0.06,0.06,0.06,0.06,0.06,0.06,0.06,0.06,0.06,0.06,0.06,0.06,0.06,0.06,0.06,0.06,0.06,0.06,0.06,0.06,0.06,0.06,0.06,0.06,0.06,0.06,0.06,0.06,0.06,0.06,0.06,0.06,0.06,0.06,0.06,0.06,0.06,0.06,0.06,0.06,0.06,0.06,0.06,0.06,0.06,0.06,0.06,0.06,0.06,0.06,0.06,0.06,0.06,0.06,0.06,0.06,0.06,0.06,0.06,0.06,0.06,0.06,0.06,0.06,0.06,0.06,0.06,0.06,0.06,0.06]
["2-1.",580,681.99,593.82000000000005,440,660,350,433.92,315,694.57,600,515,600,795.84,607,375,378,381.5,551.25,179,329.92,682.5,620,420,347.28,850,675,485,850.51,688.6,553.74,306,750,575,288.85000000000002,681.17,662.05,763.05,500,510.51,430.5,667.69,488.75,635,550,700,400,580,721.63,593.82000000000005,440,433.92,315,694.57,570.55999999999995,658.56,900,600,795.84,607.75,250,375,378,382.5,551.25,179,625,800,750,900,700,535,485,850.51,294,860,651.66999999999996,288.85000000000002,681.17,662.05,525,667.69,488.75,635,659.29,550,400,450,580,681.99,593.82000000000005,432,750,500,350,433.92,756.38,463.05,515,600,795.84,607.75,250,375,378,381,329.92,551.25,420,171,620,850,315,347.28,850,750,490,850.51,688.65,860,750,288.85000000000002,1200,681.17,662.05,525,430.5,667.69,488.75,635,550,630]
["2-2.",671.07,794.75,850,550,800,350,389.25,314,598.37,575,393.75,450,416.97,780,500,400,425,551.25,206,329.92,405.16,569,500,578.80999999999995,661.57,800,525,829.91,713,568.5,500,725,500,404.61,381.68,717.88,639.95000000000005,500,520.91999999999996,491.9,659.82,900,701.93,445,800,400,671.07,794.75,850,550,389.25,315,628.28,587.62,401.5,750,450,416.97,780,600,500,400,425,551.25,206,617,750,750,660.11,850,800,525,829.91,525,765,681.71,404.61,381.68,717.87,525,717.7,900,701.93,680.24,445,400,450,671.07,596.05999999999995,800,540,682.5,500,350,389.24,659.63,420,393.75,450,417.81,780,600,500,400,425,329.92,551.25,500,206,569,800,315,578.80999999999995,694.32,750,525,829.91,712.5,765,700,404.61,709.65,381.68,717.88,525,491.9,692.79,650,701.93,445,800]
["2-3.",1,1,1,1,1,1,1,1,1,1,1,1,1,1,1,1,1,1,1,1,1,1,1,1,1,1,1,1,1,1,1,1,1,1,1,1,1,1,1,1,1,1,1,1,1,1,1,1,1,1,1,1,1,1,1,1,1,1,1,1,1,1,1,1,1,1,1,1,1,1,1,1,1,1,1,1,1,1,1,1,1,1,1,1,1,1,1,1,1,1,1,1,1,1,1,1,1,1,1,1,1,1,1,1,1,1,1,1,1,1,1,1,1,1,1,1,1,1,1,1,1,1,1,1,1,1,1,1,1,1,1]
["2-4.",731.05,976.43,962.25,787.5,975,600,765.75,550,892.5,1000,700,650,967.58,1100,661.5,1000,820,750,850,659.84,752.45,940,800,578.80999999999995,1038.74,900,900,960.23,938,899.58,1150,787.5,945,603.75,1007.08,1002.78,833.64,850,667,850,979,500,948,850,945,800,731.05,976.43,962.25,787.5,765.75,550,937.12,854.63,955.5,800,650,967.58,1100,600,661.5,1000,820,750,890,940,1000,800,1038.74,900,1000,866.25,960.23,1100,921.9,987.32,603.75,1007.08,1002.78,825,979,500,948,799.31,875,800,708,731.05,976.43,962.25,787.5,892.5,780,600,765.75,983.88,937.12,700,650,967.58,1050,600,700,1000,752.45,659.84,750,800,850,940,1000,577.5,578.80999999999995,1038.74,900,866.25,960.23,938,921.9,900,633.92999999999995,1000,1007.08,1002.78,825,850,979,500,948,915,971]
["3-1.",498.85,578.64,625.5,450,472.5,315,433.92,500,491.98,500,412.88,500,472.5,425.4,250,520,317.5,289.39999999999998,425,347.28,289.39999999999998,490,450,231.52,600.12,500,425,437.33,520,444.02,519.75,425,360,145.53,525,500.78,498.27,350,413.26,535,549.45000000000005,440,446.63,440,485,367.5,498.85,578.64,625.5,450,433.92,500,468.56,540,432.28,450,500,472.5,425.41,200,250,322.14,338,150,425,470,525,417.25,575.77,550,600,425,437.33,519.75,445,523.52,145.53,525,469.47,450,549.45000000000005,440,446.64,385.87,445,367.5,486,498.85,578.64,575,432,315,525,420,433.92,405.12,445.68,412.88,500,472.5,425.41,200,250,520,338,347.28,289.39999999999998,550,445,515,525,500,231.52,600.12,500,425,504.12,525,445,366.3,145.53,395.03,600,500.78,450,525,549.45000000000005,460,446.64,440,535.5]
{"$rows_left_out":416}
{"sheet":"Lookups","index":3,"n_rows":132,"n_cols":4,"rows_kept":132,"cut":false,"hidden":true,"merged":[]}
["GC#","Region","CID#","Name"]
["GC728","Central",462,"Advanced Environmental Technologies, LLC"]
["GC729","Central",236,"AECOM Technical Services, Inc."]
["GC730","Central",1364,"Aerostar SES LLC"]
["GC731","Central",1259,"Wood Environment & Infrastructure Solutions, Inc."]
["GC732","Central",6,"American Compliance Technologies, Inc. d/b/a ACT Environmental & Infrastructure"]
["GC733","Central",431,"Andreyev Engineering, Inc."]
["GC734","Central",1224,"Apex Companies, LLC"]
["GC735","Central",1395,"AHS-GEAR LLC"]
["GC737","Central",145,"ARCADIS U.S., Inc."]
["GC738","Central",896,"Ardaman & Associates, Inc."]
["GC739","Central",787,"ATC Group Services, LLC dba Atlas Technical"]
["GC741","Central",311,"GHD Services, Inc"]
["GC742","Central",453,"Creative Environmental Solutions, Inc."]
["GC743","Central",299,"Earth Systems, Inc."]
{"$rows_left_out":117}