{"text_format":"1","workbook":"xlsx","n_sheets":11,"sheets":["SOW Template","Water Sampling","Soil-Air Sampling","SB-Well Installation","WA","O&M Parameters","RAC","SR","Analytical Lookup","Sheet2","Sheet1"],"not_rendered":{"charts":0,"images":1,"macros":1,"external_links":0,"defined_names":45,"comments":6,"pivot_tables":0},"unopened":[],"bounds":{"document_bytes":16777216,"sheet_cells":100000,"rows_first":2000,"rows_last":500,"rows_between":2000,"halvings":0,"cell_chars":16384,"cell_head_chars":4096},"cells_cut":0,"cells_raw":0,"read":"whole","date_system":"1900"}

{"sheet":"SOW Template","index":0,"n_rows":78,"n_cols":6,"rows_kept":78,"cut":false,"hidden":false,"merged":[[0,0,0,3],[1,0,1,3],[2,0,2,3],[35,0,35,2],[40,0,40,2],[39,0,39,2],[38,0,38,2],[37,0,37,2],[36,0,36,2],[13,0,13,3],[7,0,7,1],[20,2,20,3],[22,2,22,3],[77,0,77,3],[70,0,70,3],[72,0,72,3],[74,0,74,3],[75,0,75,3],[76,0,76,3],[67,0,67,3],[68,0,68,3],[71,0,71,3],[73,0,73,3],[24,2,24,3],[26,2,26,3],[57,0,57,2],[58,0,58,2],[52,0,52,2],[53,0,53,2],[54,0,54,2],[55,0,55,2],[56,0,56,2],[34,0,34,3],[30,2,30,3],[41,0,41,2],[42,0,42,2],[43,0,43,2],[32,2,32,3],[49,0,49,2],[28,2,28,3],[65,0,65,2],[64,0,64,2],[60,0,60,2],[61,0,61,2],[62,0,62,2],[63,0,63,2],[51,0,51,2],[59,0,59,2],[50,0,50,2],[44,0,44,2],[45,0,45,2],[46,0,46,2],[47,0,47,2],[48,0,48,2]]}
["Attachment A"]
["Petroleum Restoration Program"]
["Scope of Work"]
[]
[null,null,"9-Digit Facility ID Number:"]
[null,null,"STCM Facility Name:"]
[]
["SubPhase(s):",null,null,null,true]
[null,null,null,null,{"$f":"IF(C9<>\"\",TRUE,FALSE)","v":false}]
[null,null,null,null,{"$f":"IF(C10<>\"\",TRUE,FALSE)","v":false}]
[null,null,null,null,false]
[null,null,null,null,false]
[null,null,null,null,true]
["Specifications\nAll work must be performed in accordance with this Scope of Work (SOW) and any attachments, Chapters 62-160, 62-532, 62-777 and 62-780, F.A.C., all applicable FDEP and Water Management District guidance memoranda, standard industry procedures and as described in the Agency Term Contract (ATC).\nCopies of all referenced guidelines are available at: ",null,null,null,true]
["http://floridadep.gov/waste/petroleum-restoration",null,null,null,true]
["Reports must be submitted using the appropriate FDEP forms found at:",null,null,null,true]
["http://floridadep.gov/waste/petroleum-restoration/content/procedures-guidance-documents",null,null,null,true]
["All work must be conducted in accordance with PRP Standard Specification Details found at:",null,null,null,true]
["http://floridadep.gov/waste/petroleum-restoration/content/templates-forms-tools-and-guidance",null,null,null,true]
["The following tables are included as attachments to this SOW and further represent the details of the scope of work.",null,null,null,true]
{"$rows_left_out":59}
{"sheet":"Water Sampling","index":1,"n_rows":111,"n_cols":22,"rows_kept":111,"cut":false,"hidden":false,"merged":[[0,8,0,18],[110,0,110,3]]}
[null,"FDEP Facility ID#:  ",{"$f":"IF('SOW Template'!D5=\"\",\"\",'SOW Template'!D5)","v":""},null,null,null,null,"STCM Facility Name:  ",{"$f":"IF('SOW Template'!D6=\"\",\"\",'SOW Template'!D6)","v":""}]
[]
["Any blank fields are not applicable to the scope of work."]
["WATER SAMPLING TABLE"]
["Task #","Well #(s) or Water Sample Location","Frequency\n(if applicable)","Expedited Turnaround (TA)","Water Level/FP Gauging Only","# MWs\nSampled","BTEX + MTBE","PAHs","TRPH (FL-PRO)"]
[null,null,null,null,null,null,null,null,null,null,null,null,null,null,null,null,null,null,null,null,null,{"$f":"IF(A6<>\"\",TRUE,FALSE)","v":false}]
[null,null,null,null,null,null,null,null,null,null,null,null,null,null,null,null,null,null,null,null,null,{"$f":"IF(A7<>\"\",TRUE,FALSE)","v":false}]
[null,null,null,null,null,null,null,null,null,null,null,null,null,null,null,null,null,null,null,null,null,false]
[null,null,null,null,null,null,null,null,null,null,null,null,null,null,null,null,null,null,null,null,null,false]
[null,null,null,null,null,null,null,null,null,null,null,null,null,null,null,null,null,null,null,null,null,false]
[null,null,null,null,null,null,null,null,null,null,null,null,null,null,null,null,null,null,null,null,null,false]
[null,null,null,null,null,null,null,null,null,null,null,null,null,null,null,null,null,null,null,null,null,false]
[null,null,null,null,null,null,null,null,null,null,null,null,null,null,null,null,null,null,null,null,null,false]
[null,null,null,null,null,null,null,null,null,null,null,null,null,null,null,null,null,null,null,null,null,false]
[null,null,null,null,null,null,null,null,null,null,null,null,null,null,null,null,null,null,null,null,null,false]
[null,null,null,null,null,null,null,null,null,null,null,null,null,null,null,null,null,null,null,null,null,false]
[null,null,null,null,null,null,null,null,null,null,null,null,null,null,null,null,null,null,null,null,null,false]
[null,null,null,null,null,null,null,null,null,null,null,null,null,null,null,null,null,null,null,null,null,false]
[null,null,null,null,null,null,null,null,null,null,null,null,null,null,null,null,null,null,null,null,null,false]
[null,null,null,null,null,null,null,null,null,null,null,null,null,null,null,null,null,null,null,null,null,false]
{"$rows_left_out":92}
{"sheet":"Soil-Air Sampling","index":2,"n_rows":76,"n_cols":21,"rows_kept":76,"cut":false,"hidden":false,"merged":[[0,7,0,17],[75,0,75,4]]}
[null,"FDEP Facility ID#:  ",{"$f":"IF('SOW Template'!D5=\"\",\"\",'SOW Template'!D5)","v":""},null,null,null,"STCM Facility Name:  ",{"$f":"IF('SOW Template'!D6=\"\",\"\",'SOW Template'!D6)","v":""}]
[]
["Any blank fields are not applicable to the scope of work."]
["SOIL and AIR SAMPLING TABLE"]
["Task #","Soil /Air Sample Locations","Frequency\n(if applicable)","Expedited Turnaround (TA)","Depth Interval\n(if applicable)","BTEX + MTBE + VOHs","VOHs","TRPH (FL-PRO)"]
[null,null,null,null,null,null,null,null,null,null,null,null,null,null,null,null,null,null,null,null,{"$f":"IF(A6<>\"\",TRUE,FALSE)","v":false}]
[null,null,null,null,null,null,null,null,null,null,null,null,null,null,null,null,null,null,null,null,false]
[null,null,null,null,null,null,null,null,null,null,null,null,null,null,null,null,null,null,null,null,false]
[null,null,null,null,null,null,null,null,null,null,null,null,null,null,null,null,null,null,null,null,false]
[null,null,null,null,null,null,null,null,null,null,null,null,null,null,null,null,null,null,null,null,false]
[null,null,null,null,null,null,null,null,null,null,null,null,null,null,null,null,null,null,null,null,false]
[null,null,null,null,null,null,null,null,null,null,null,null,null,null,null,null,null,null,null,null,false]
[null,null,null,null,null,null,null,null,null,null,null,null,null,null,null,null,null,null,null,null,false]
[null,null,null,null,null,null,null,null,null,null,null,null,null,null,null,null,null,null,null,null,false]
[null,null,null,null,null,null,null,null,null,null,null,null,null,null,null,null,null,null,null,null,false]
[null,null,null,null,null,null,null,null,null,null,null,null,null,null,null,null,null,null,null,null,false]
[null,null,null,null,null,null,null,null,null,null,null,null,null,null,null,null,null,null,null,null,false]
[null,null,null,null,null,null,null,null,null,null,null,null,null,null,null,null,null,null,null,null,false]
[null,null,null,null,null,null,null,null,null,null,null,null,null,null,null,null,null,null,null,null,false]
[null,null,null,null,null,null,null,null,null,null,null,null,null,null,null,null,null,null,null,null,false]
{"$rows_left_out":57}
{"sheet":"SB-Well Installation","index":3,"n_rows":53,"n_cols":19,"rows_kept":53,"cut":false,"hidden":false,"merged":[[0,8,0,16],[52,0,52,3],[4,5,4,7],[4,0,4,4],[4,8,4,17],[52,5,52,12],[52,14,52,15]]}
[null,"FDEP Facility ID#:  ",{"$f":"IF('SOW Template'!D5=\"\",\"\",'SOW Template'!D5)","v":""},null,null,null,null,"STCM Facility Name:  ",{"$f":"IF('SOW Template'!D6=\"\",\"\",'SOW Template'!D6)","v":""}]
[]
["Any blank fields are not applicable to the scope of work."]
["SOIL BORING (SB) and WELL INSTALLATION TABLE"]
["SOIL BORING DETAILS",null,null,null,null,"Screening/Split Spoon Intervals",null,null,"WELL INSTALLATION DETAILS  "]
["TASK #","Installation\nMethod","Quantity","Depth\n(ft bls)","Total\nBoring\nFootage\n(ft)","Screening\nDepth\nInterval 1\n& Spacing","Screening\nDepth\nInterval 2\n& Spacing","Screening\nDepth\nInterval 3\n& Spacing","Quantity","Well Type","Well Diameter (in)","Depth \n(ft bls)","Screen Interval\n(ft bls)","Total\nWell\nFootage\n(ft)","Surface Casing Diameter\n(in)","Surface Casing Depth\n(ft)","Total\nCasing\nFootage\n(ft)","Well\nCompletion\nType"]
[null,null,null,null,{"$f":"IF(A7>0,(C7*D7),0)","v":0},null,null,null,null,null,null,null,null,{"$f":"IF(A7>0,(I7*L7),0)","v":0},null,null,{"$f":"IF(A7>0,(I7*P7),0)","v":0},null,{"$f":"IF(A7<>\"\",TRUE,FALSE)","v":false}]
[null,null,null,null,{"$f":"IF(A8>0,(C8*D8),0)","v":0},null,null,null,null,null,null,null,null,{"$f":"IF(A8>0,(I8*L8),0)","v":0},null,null,{"$f":"IF(A8>0,(I8*P8),0)","v":0},null,{"$f":"IF(A8<>\"\",TRUE,FALSE)","v":false}]
[null,null,null,null,0,null,null,null,null,null,null,null,null,0,null,null,0,null,false]
[null,null,null,null,0,null,null,null,null,null,null,null,null,0,null,null,0,null,false]
[null,null,null,null,0,null,null,null,null,null,null,null,null,0,null,null,0,null,false]
[null,null,null,null,0,null,null,null,null,null,null,null,null,0,null,null,0,null,false]
[null,null,null,null,0,null,null,null,null,null,null,null,null,0,null,null,0,null,false]
[null,null,null,null,0,null,null,null,null,null,null,null,null,0,null,null,0,null,false]
[null,null,null,null,0,null,null,null,null,null,null,null,null,0,null,null,0,null,false]
[null,null,null,null,0,null,null,null,null,null,null,null,null,0,null,null,0,null,false]
[null,null,null,null,0,null,null,null,null,null,null,null,null,0,null,null,0,null,false]
[null,null,null,null,0,null,null,null,null,null,null,null,null,0,null,null,0,null,false]
[null,null,null,null,0,null,null,null,null,null,null,null,null,0,null,null,0,null,false]
[null,null,null,null,0,null,null,null,null,null,null,null,null,0,null,null,0,null,false]
{"$rows_left_out":34}
{"sheet":"WA","index":4,"n_rows":107,"n_cols":14,"rows_kept":107,"cut":false,"hidden":false,"merged":[[0,5,0,7],[3,0,3,7],[102,0,102,3],[102,4,102,6],[4,0,5,0],[4,1,5,1],[4,2,5,2],[4,3,5,3],[4,4,5,4]]}
[null,"FDEP Facility ID#:  ",{"$f":"IF('SOW Template'!D5=\"\",\"\",'SOW Template'!D5)","v":""},null,"STCM Facility Name:",{"$f":"IF('SOW Template'!D6=\"\",\"\",'SOW Template'!D6)","v":""}]
[]
["Any blank fields are not applicable to this scope of work."]
["Well Abandonment Table"]
["TASK #","Well-ID","Quantity","Diameter (in)","Depth\n(ft bls)",null,"Completion Type to be Removed"]
[null,null,null,null,null,"Pad & Manhole","2' x 2' x 2'\n Vault","4' x 4' x 2'\nVault"]
[null,null,null,null,null,null,null,null,null,{"$f":"IF(A7<>\"\",TRUE,FALSE)","v":false},{"$f":"IF(A7<>\"\",E7*C7,0)","v":0},{"$f":"IF(E7=\"\",F7,0)","v":0},{"$f":"IF(A7<>\"\",G7,0)","v":0},{"$f":"IF(A7<>\"\",H7,0)","v":0}]
[null,null,null,null,null,null,null,null,null,false,{"$f":"IF(A8<>\"\",E8*C8,0)","v":0},{"$f":"IF(E8=\"\",F8,0)","v":0},{"$f":"IF(A8<>\"\",G8,0)","v":0},{"$f":"IF(A8<>\"\",H8,0)","v":0}]
[null,null,null,null,null,null,null,null,null,false,0,0,0,0]
[null,null,null,null,null,null,null,null,null,false,0,0,0,0]
[null,null,null,null,null,null,null,null,null,false,0,0,0,0]
[null,null,null,null,null,null,null,null,null,false,0,0,0,0]
[null,null,null,null,null,null,null,null,null,false,0,0,0,0]
[null,null,null,null,null,null,null,null,null,false,0,0,0,0]
[null,null,null,null,null,null,null,null,null,false,0,0,0,0]
[null,null,null,null,null,null,null,null,null,false,0,0,0,0]
[null,null,null,null,null,null,null,null,null,false,0,0,0,0]
[null,null,null,null,null,null,null,null,null,false,0,0,0,0]
[null,null,null,null,null,null,null,null,null,false,0,0,0,0]
[null,null,null,null,null,null,null,null,null,false,0,0,0,0]
{"$rows_left_out":88}
{"sheet":"O&M Parameters","index":5,"n_rows":60,"n_cols":12,"rows_kept":60,"cut":false,"hidden":false,"merged":[[3,0,3,10],[0,5,0,9]]}
[null,"FDEP Facility ID#:  ",{"$f":"IF('SOW Template'!D5=\"\",\"\",'SOW Template'!D5)","v":""},null,"STCM Facility Name:",{"$f":"IF('SOW Template'!D6=\"\",\"\",'SOW Template'!D6)","v":""}]
[]
["Any blank fields are not applicable to this scope of work."]
["O&M (System) Parameters Table"]
["TASK #(s)","Location\n(e.g., MW-X, Manifold, Influent, Effluent, etc.)","Frequency \n(if applicable)","Depth to Water (DTW)","Dissolved Oxygen (DO)","Pressure/ Vacuum","Flow","OVA","Hour Meter Reading","Observations"]
[null,null,null,null,null,null,null,null,null,null,null,{"$f":"IF(A6<>\"\", TRUE, FALSE)","v":false}]
[null,null,null,null,null,null,null,null,null,null,null,{"$f":"IF(A7<>\"\", TRUE, FALSE)","v":false}]
[null,null,null,null,null,null,null,null,null,null,null,false]
[null,null,null,null,null,null,null,null,null,null,null,false]
[null,null,null,null,null,null,null,null,null,null,null,false]
[null,null,null,null,null,null,null,null,null,null,null,false]
[null,null,null,null,null,null,null,null,null,null,null,false]
[null,null,null,null,null,null,null,null,null,null,null,false]
[null,null,null,null,null,null,null,null,null,null,null,false]
[null,null,null,null,null,null,null,null,null,null,null,false]
[null,null,null,null,null,null,null,null,null,null,null,false]
[null,null,null,null,null,null,null,null,null,null,null,false]
[null,null,null,null,null,null,null,null,null,null,null,false]
[null,null,null,null,null,null,null,null,null,null,null,false]
[null,null,null,null,null,null,null,null,null,null,null,false]
{"$rows_left_out":41}
{"sheet":"RAC","index":6,"n_rows":53,"n_cols":11,"rows_kept":53,"cut":false,"hidden":false,"merged":[[53,0,53,10],[27,7,27,8],[28,7,28,8],[29,7,29,8],[30,7,30,8],[41,7,41,10],[42,7,42,10],[43,7,43,10],[44,7,44,10],[45,7,45,10],[27,0,27,6],[28,0,28,6],[29,0,29,6],[30,0,30,6],[31,0,31,10],[32,0,32,6],[3,0,3,10],[4,0,4,10],[5,0,5,10],[6,0,6,6],[0,7,0,10],[2,0,2,10],[0,0,0,1],[0,5,0,6],[0,3,0,4],[7,0,7,6],[8,0,8,6],[9,0,9,6],[10,0,10,6],[11,0,11,6],[12,0,12,6],[13,0,13,6],[14,0,14,6],[15,0,15,6],[16,0,16,6],[17,0,17,6],[18,0,18,6],[19,0,19,6],[20,0,20,6],[21,0,21,6],[22,0,22,10],[23,0,23,6],[24,0,24,6],[25,0,25,6],[26,0,26,6],[33,0,33,6],[34,0,34,6],[35,0,35,6],[36,0,36,6],[37,0,37,10],[38,0,38,6],[39,0,39,6],[40,0,40,6],[41,0,41,6],[42,0,42,6],[43,0,43,6],[44,0,44,6],[45,0,45,6],[46,0,46,10],[52,0,52,10],[47,0,47,6],[48,0,48,6],[49,0,49,6],[50,0,50,6],[51,0,51,6]]}
["FDEP Facility ID#:  ",null,{"$f":"IF('SOW Template'!D5=\"\",\"\",'SOW Template'!D5)","v":""},null,null,"STCM Facility Name:  ",null,{"$f":"IF('SOW Template'!D6=\"\",\"\",'SOW Template'!D6)","v":""}]
[]
["Any blank fields are not applicable to the scope of work."]
["Remedial Action Construction Table"]
["SPI Section 5 and 6"]
["Well Installation Specifications"]
["Process Type (AS, SVE, MPX, GWT, etc)"]
["Total System Well Count"]
["Existing Wells to be Used"]
["New System Wells",null,null,null,null,null,null,{"$f":"H8-H9","v":0},{"$f":"I8-I9","v":0},{"$f":"J8-J9","v":0},{"$f":"K8-K9","v":0}]
["Well Type (HW, VW, AW)"]
["Well Diameter (inches)"]
["Boring Length (feet)"]
["Well Length (feet)"]
["Screened Length (feet) "]
["Well Vaults"]
["Slot Size (inches)"]
["Well Material (HDPE, PVC)"]
["Installation Method (DPT, HSA, MR, Sonic, Open Trench)"]
["Boring Diameter (inches)"]
{"$rows_left_out":34}
{"sheet":"SR","index":7,"n_rows":59,"n_cols":10,"rows_kept":59,"cut":false,"hidden":false,"merged":[[9,0,9,5],[10,0,10,5],[4,0,4,9],[5,0,5,9],[6,0,6,5],[7,0,7,5],[8,0,8,5],[0,6,0,9],[0,0,0,1],[0,4,0,5],[2,0,2,9],[3,0,3,9],[16,0,16,5],[11,9,14,9],[17,9,21,9],[17,0,17,5],[18,0,18,5],[19,0,19,5],[20,0,20,5],[21,0,21,5],[11,0,11,5],[12,0,12,5],[13,0,13,5],[14,0,14,5],[15,0,15,5],[22,0,22,5],[23,0,23,9],[24,0,24,5],[25,0,25,5],[26,0,26,5],[32,0,32,9],[33,0,33,5],[34,0,34,5],[35,0,35,5],[27,0,27,5],[28,0,28,5],[29,0,29,5],[30,0,30,5],[31,0,31,5],[36,0,36,5],[37,0,37,5],[38,0,38,5],[39,0,39,9],[40,0,40,9],[36,6,36,9],[37,6,37,9],[41,0,41,5],[42,0,42,5],[43,0,43,5],[44,0,44,5],[45,0,45,9],[46,0,46,5],[47,0,47,5],[48,0,48,5],[49,0,49,9],[50,0,50,9],[51,7,51,9],[53,7,53,9],[56,0,56,9],[58,0,58,9],[51,0,51,5],[52,0,52,5],[53,0,53,5],[54,0,54,5],[55,0,55,5],[57,0,57,9]]}
["FDEP Facility ID#:  ",null,{"$f":"IF('SOW Template'!D5=\"\",\"\",'SOW Template'!D5)","v":""},null,"STCM Facility Name:  ",null,{"$f":"IF('SOW Template'!D6=\"\",\"\",'SOW Template'!D6)","v":""}]
[]
["Any blank fields are not applicable to the scope of work."]
["Source Removal Table"]
["SPI Section 10"]
["Sheet Piling"]
["Sheet Piling Length (feet)"]
["Sheet Piling Depth (feet)"]
["Sheet Piling Area (square feet†)",null,null,null,null,null,{"$f":"ROUNDUP(G7*G8,0)","v":0}]
["Sheet Piling Duration (number of days/weeks/months)"]
["Conventional Excavation Volume",null,null,null,null,null,"Area 1","Area 2","Area 3","Total"]
["Excavation Length (feet)"]
["Excavation Width (feet)"]
["Excavation Area (square feet)",null,null,null,null,null,{"$f":"G12*G13","v":0},{"$f":"H12*H13","v":0},{"$f":"I12*I13","v":0}]
["Excavation Depth (feet)"]
["Maximum Excavation Volume (cubic yards†)",null,null,null,null,null,{"$f":"ROUNDUP(G14*G15/27, 0)","v":0},{"$f":"ROUNDUP(H14*H15/27,0)","v":0},{"$f":"ROUNDUP(I14*I15/27,0)","v":0},{"$f":"SUM(G16:I16)","v":0}]
["LDA Excavation Volume*",null,null,null,null,null,"Area 1","Area 2","Area 3","Total"]
["Diameter of LDA (feet)"]
["LDA boring area (square feet)",null,null,null,null,null,{"$f":"PI()*G18*G18/4","v":0},{"$f":"PI()*H18*H18/4","v":0},{"$f":"PI()*I18*I18/4","v":0}]
["LDA Depth (feet)"]
{"$rows_left_out":40}
{"sheet":"Analytical Lookup","index":8,"n_rows":93,"n_cols":8,"rows_kept":93,"cut":false,"hidden":false,"merged":[[12,0,12,1],[1,0,1,1],[2,0,2,1],[3,0,3,1],[4,0,4,1],[5,0,5,1],[6,0,6,1],[7,0,7,1],[8,0,8,1],[9,0,9,1],[10,0,10,1],[11,0,11,1],[24,0,24,1],[13,0,13,1],[14,0,14,1],[15,0,15,1],[16,0,16,1],[17,0,17,1],[18,0,18,1],[19,0,19,1],[20,0,20,1],[21,0,21,1],[22,0,22,1],[23,0,23,1],[36,0,36,1],[25,0,25,1],[26,0,26,1],[27,0,27,1],[28,0,28,1],[29,0,29,1],[30,0,30,1],[31,0,31,1],[32,0,32,1],[33,0,33,1],[34,0,34,1],[35,0,35,1],[48,0,48,1],[37,0,37,1],[38,0,38,1],[39,0,39,1],[40,0,40,1],[41,0,41,1],[42,0,42,1],[43,0,43,1],[44,0,44,1],[45,0,45,1],[46,0,46,1],[47,0,47,1],[60,0,60,1],[49,0,49,1],[50,0,50,1],[51,0,51,1],[52,0,52,1],[53,0,53,1],[54,0,54,1],[55,0,55,1],[56,0,56,1],[57,0,57,1],[58,0,58,1],[59,0,59,1],[72,0,72,1],[61,0,61,1],[62,0,62,1],[63,0,63,1],[64,0,64,1],[65,0,65,1],[66,0,66,1],[67,0,67,1],[68,0,68,1],[69,0,69,1],[70,0,70,1],[71,0,71,1],[84,0,84,1],[73,0,73,1],[74,0,74,1],[75,0,75,1],[76,0,76,1],[77,0,77,1],[78,0,78,1],[79,0,79,1],[80,0,80,1],[81,0,81,1],[82,0,82,1],[83,0,83,1]]}
["Analytical Pay Items from SPI",null,null,"Drop-down Text"]
["SOIL/SEDIMENT ANALYSIS",null,null,"SOIL/SEDIMENT ANALYSIS"]
["Soil, Used Oil/Unknown Product Group-Table D of Ch. 62-780, F.A.C., except for non-Priority Pollutant Organics (multiple methods)",null,null,"Table D Used Oil"]
["Soil, BTEX + MTBE (EPA 8021 or EPA 8260)",null,null,"BTEX + MTBE"]
["Soil, Volatile Organic Halocarbons (EPA 8021 or EPA 8260)",null,null,"VOHs"]
["Soil, BTEX + MTBE + VOHs (EPA 8021 or EPA 8260)",null,null,"BTEX + MTBE + VOHs"]
["Soil, Polycyclic Aromatic Hydrocarbons (EPA 8270 or EPA 8310)",null,null,"PAHs"]
["Soil, Priority Pollutant Volatile Organics (EPA 8260)",null,null,"Priority Pollutant Volatile Organics"]
["Soil, Priority Pollutant Extractable Organics-Base Neutral and Acid Extractables (EPA 8270 list [e.g., EPA 8081/8082 + EPA 8270])",null,null,"Priority Pollutant Extractable Organics"]
["Soil, Total Recoverable Petroleum Hydrocarbons (FL-PRO)",null,null,"TRPH (FL-PRO)"]
["Soil, TRPH Fractionation (MADEP-EPH/VPH Method or TPHCWG Direct Method)",null,null,"TRPH Fractionation"]
["Soil, PCBs [or Aroclors] (EPA 8082)",null,null,"PCBs [or Aroclors]"]
["Soil, 8 RCRA Metals (EPA 6010 or EPA 6020 [Arsenic, Barium, Cadmium, Chromium, Lead, Selenium, Silver] and EPA 6020 or EPA 7471 [Mercury])",null,null,"8 RCRA Metals"]
["Soil, Arsenic (EPA 6010 or EPA 6020)",null,null,"Arsenic"]
["Soil, Cadmium (EPA 6010 or EPA 6020)",null,null,"Cadmium"]
["Soil, Chromium (EPA 6010 or EPA 6020)",null,null,"Chromium"]
["Soil, Lead (EPA 6010 or EPA 6020)",null,null,"Lead"]
["Soil, Toxicity Characteristic Leaching Procedure-Extraction Only (EPA 1311)",null,null,"TCLP-Extraction Only"]
["Soil, Synthetic Precipitation Leaching Procedure-Extraction Only (EPA1312)",null,null,"SPLP-Extraction Only"]
["Soil, Organic Carbon, Total (EPA 9060 or Walkey-Black)",null,null,"Total Organic Carbon"]
{"$rows_left_out":74}
{"sheet":"Sheet2","index":9,"n_rows":67,"n_cols":23,"rows_kept":67,"cut":false,"hidden":true,"merged":[]}
["Boringtype",null,"Completiontype",null,1,null,"Frequency3",null,"GroundwaterTreatment",null,"Process",null,"System",null,"Treatment2",null,"Size2",null,"Usage",null,"Material",null,"Turnaround"]
["Hand Auger",null,"8\" MH",null,2,null,"Once",null,"On-site Treatment",null,"AS",null,"AS",null,"Carbon",null,"Small",null,"<=6 months",null,"SCH 40",null,"1-day TA"]
["DPT",null,"12\" MH",null,3,null,"Daily",null,"Sanitary",null,"SVE",null,"AS/SVE",null,"Thermox",null,"Medium",null,">6 months",null,"SCH 80",null,"3-day TA"]
["HSA/MR",null,"2x2 Vault",null,4,null,"Weekly",null,"Off-site Disposal",null,"MPX",null,"AS/MPX",null,"Catox",null,"Large",null,null,null,"HDPE",null,"7-day TA"]
["Sonic",null,"4x4 Vault",null,5,null,"Monthly",null,null,null,"GWT",null,"MPX"]
[null,null,"Above Ground",null,6,null,"Quarterly",null,null,null,"Injection",null,"GWT"]
[null,null,"None",null,7,null,"Semi-Annually"]
[null,null,null,null,8,null,"Annually"]
[null,null,null,null,9]
[null,null,null,null,10]
[]
[]
[]
[]
["SOILAIR4",null,null,null,null,"WATER",null,null,null,null,null,null,"Duration",null,"WellType",null,"Install",null,"Grass",null,"Dewatering"]
[null,null,null,null,null,null,null,null,null,null,null,null,"Days",null,"HW",null,"DPT",null,"Sod",null,"On-site"]
["Table D Used Oil",null,null,null,null,"GAG/KEG - Table C",null,null,null,null,null,null,"Week(s)",null,"VW",null,"HSA",null,"Seed & Mulch",null,"Off-site"]
["BTEX + MTBE",null,null,null,null,"Used Oil/Unknown Product Group-Table D",null,null,null,null,null,null,"Month(s)",null,"AW",null,"MR"]
["VOHs",null,null,null,null,"BTEX + MTBE",null,null,null,null,null,null,null,null,null,null,"Sonic"]
["BTEX + MTBE + VOHs",null,null,null,null,"VOHs",null,null,null,null,null,null,null,null,null,null,"Open Trench"]
{"$rows_left_out":48}
{"sheet":"Sheet1","index":10,"n_rows":6,"n_cols":1,"rows_kept":6,"cut":false,"hidden":true,"merged":[]}
["Daily"]
["Weekly"]
["Monthly"]
["Quarterly"]
["Semi-Annually"]
["Annually"]