{"text_format":"1","workbook":"xlsx","n_sheets":9,"sheets":["DropDown","Read Me","Site Info","LVI Taxa List","LVI Calculator","4.Lake_Observation","5. Lake HA","6.Dominat Taxa Photos","7.ExtenalBioFormat"],"not_rendered":{"charts":0,"images":1,"macros":1,"external_links":0,"defined_names":7,"comments":0,"pivot_tables":0},"unopened":[],"bounds":{"document_bytes":16777216,"sheet_cells":100000,"rows_first":2000,"rows_last":500,"rows_between":2000,"halvings":0,"cell_chars":16384,"cell_head_chars":4096},"cells_cut":0,"cells_raw":0,"read":"whole","date_system":"1900"}

{"sheet":"DropDown","index":0,"n_rows":69,"n_cols":30,"rows_kept":69,"cut":false,"hidden":true,"merged":[]}
["COUNTY","Region",null,"Segments",null,null,"% Native Taxa","% FLEPPC Taxa","% Sensitive Taxa","Dominant Taxa C of C",null,"Area Units",null,null,null,null,"Level III","Level III Name",null,"Level IV","Level IV Name",null,null,"VOB"]
["Alachua","North",null,"1, 4, 7, 10",null,"North","(X-62.5)/37.5","1-(X/30)","X/27.78","X/7.91",null,"km2",null,null,"65-Southeastern Plains","t2:u12",65,"Southeastern Plains",null,"65f","Southern Pine Plains and Hills",null,null,20,null,null,"native taxa","flnative",1]
["Baker","North",null,"2, 5, 8, 11",null,"South","(X-66.67)/25.89","1-(X/30)","X/20","X/7.0",null,"hectares",null,null,"75-Southern Coastal Plain","t13:u23",65,"Southeastern Plains",null,"65g","Dougherty Plain",null,null,19,null,null,null,null,"wetlansstatus","3, 4, 5, 8, 9"]
["Bay","North",null,"3, 6, 9, 12",null,null,null,null,null,null,null,"m2",null,null,"76-Southern Florida Coastal Plain","t24:u34",65,"Southeastern Plains",null,"65h","Tifton Upland",null,null,18,null,null,null,"or","taxia ID",18036]
["Bradford","North",null,"Required",null,null,null,null,null,null,null,"mi2",null,null,null,null,65,"Southeastern Plains",null,"65o","Tallahasee Hills/Valdosta Limesink",null,null,17]
["Brevard","Must Enter Lattitiude",null,null,null,"Metric",{"$f":"'LVI Calculator'!B15","v":"Segment 1"},{"$f":"'LVI Calculator'!C15","v":"Segment 4"},{"$f":"'LVI Calculator'!D15","v":"Segment 7"},{"$f":"'LVI Calculator'!E15","v":"Segment 10"},null,"acres",null,null,null,null,65,"Southeastern Plains",null,"65p","Southeastern Floodplains and Low Terraces",null,null,16,null,null,null,"or","growthhabit",7]
{"$rows_left_out":64}
{"sheet":"Read Me","index":1,"n_rows":11,"n_cols":1,"rows_kept":11,"cut":false,"hidden":false,"merged":[[8,0,8,10],[10,0,10,10],[0,0,0,10],[1,0,1,10],[2,0,2,10],[4,0,4,10],[5,0,5,10],[6,0,6,10]]}
["LAKE VEGETATION INDEX (LVI) CALCULATOR"]
["Based on FDEP-SOP-003/11 (Revision Date January 2017), LVI 2200 \"Lake Vegetation Index Determination\"\nCalculator Created July 2024"]
["Definition: The LVI is a regional multimetric biological assessment of lake health using the aquatic plant community to determines how closely a lake’s flora resembles that of an undisturbed lake.  The LVI field method and calculations are described in “Assessing the Biological Condition of Florida Lakes:  Development of the Lake Vegetation Index (LVI), 2007 Fore, Leska S.,” with updates in the calculations described in “Development of Aquatic Life Use Support Attainment Thresholds for Florida’s Stream Condition Index and Lake Vegetation Index, DEP-SAS-003/11.”  All LVI sampling and analysis shall be conducted according to the requirements of this LVI method and the LVI Primer (Sampling and Use of the Lake Vegetation Index (LVI) for Assessing Lake Plant Communities in Florida: A Primer [DEP-SAS-002/11; May 20, 2026]).  In order to submit LVI data to DEP, sampling teams must demonstrate competency per the requirements in LVI 1200. All team members must take and pass the LVI method test, and pass the team testing exercise. Each team shall contain at least one individual who maintains “pass status” for the plant identification test per LVI 1200.  Sampling for the LVI should be conducted from April 1 to November 30 in the South LVI region and May 1 to October 31 in the North LVI region. Each macrophyte taxon observed in each of four (4) lake segments is identified to the lowest practical taxonomic level as described in the LVI Primer.  Those data are then entered on the LVI Taxa List tab of the calculator to calculate the LVI."]
[]
["Index Calculation:  The LVI has four (4) metrics: \n1) Percent Native taxa \n2) Percent FISC Category 1 Invasive Species \n3) Percent Sensitive Taxa \n4) Coefficient of Conservatism (C of C) score for Dominant Taxa"]
["A score for each of the four metrics is calculated for each of the four lake segments based on the macrophyte taxa present in the segment.  The four metric scores for each segment are averaged to give a LVI score for the segment.  The four segment LVI scores are then averaged to get the final LVI score for the lake."]
{"$rows_left_out":6}
{"sheet":"Site Info","index":2,"n_rows":32,"n_cols":10,"rows_kept":32,"cut":false,"hidden":false,"merged":[[27,0,27,2],[25,1,25,2],[1,4,1,10],[28,0,28,1],[0,0,0,2],[22,1,22,2],[23,1,23,2],[24,1,24,2],[1,1,1,2],[3,1,3,2],[2,1,2,2],[18,1,18,2]]}
["Please Enter Site Information in Shaded Fields Below As Described"]
["Lake Name","Low Lake",null,null,"Geographic Coordinate Converter"]
["Sampling Entity","Northeast District Biologists",null,null,"x/y","Degrees","Minutes","Seconds",null,"Decimal Degrees"]
["WIN Organization ID","21FLA",null,null,"LATITUDE",30,13,18,null,{"$f":"IF(F4<0,(F4-(G4/60)-(H4/3600)),(1*(F4+(G4/60)+(H4/3600))))","v":30.221666666666664}]
["WIN Station ID",21020065,null,null,"LONGITUDE",82,50,10,null,{"$f":"IF(F5<0,(F5-(G5/60)-(H5/3600)),(-1*(F5+(G5/60)+(H5/3600))))","v":-82.836111111111109}]
["WIN Sampling Location Description","LOWREF"]
{"$rows_left_out":27}
{"sheet":"LVI Taxa List","index":3,"n_rows":1522,"n_cols":20,"rows_kept":1522,"cut":false,"hidden":false,"merged":[[6,10,6,12],[11,0,11,1],[1,0,1,12],[2,0,2,12],[3,0,3,12],[4,0,4,12],[6,2,6,3],[7,2,7,3],[6,6,6,7],[7,6,7,7],[6,4,6,5],[7,4,7,5],[12,10,12,13],[12,2,12,5],[9,2,9,3],[10,2,10,3],[8,0,8,9],[12,6,12,9],[11,9,11,12],[7,10,10,12],[0,0,0,9],[10,4,10,5],[10,6,10,7],[9,4,9,5],[9,6,9,7]]}
["LAKE VEGETATION INDEX (LVI) CALCULATOR\nBased on FDEP-SOP-002/01, LVI 2200 Vegetation Index\nCreated July 1, 2024"]
["1) Start by pressing the \"Clear Previous Data Entries\" button to clear all data previously entered and taxa selected."]
["2) Select lake segments sampled.  Other site information automatically copied from Site Info tab."]
["3) Then for each of the four lake segments sampled, select all macrophyte taxa present in the segment by entering   \"D\" to denote a Dominant taxa, \n\"C\" to denote Co-Dominant Taxa, or a \"P\" to identify all other taxa present in columns C through F, respectively.  Only one dominant or two co-dominant\n taxa are allowed per segment.  (If a Taxa is not found in Column A, also search in the Column B as a synonym.) "]
["4) When all the appropriate taxa have been identified, press the \"Calculate LVI\" button to calculate the Lake Vegetation index Value."]
[]
{"$rows_left_out":1517}
{"sheet":"LVI Calculator","index":4,"n_rows":39,"n_cols":16,"rows_kept":39,"cut":false,"hidden":false,"merged":[[0,0,0,12],[1,10,1,12],[2,10,10,12],[11,5,11,12],[12,0,12,9],[9,0,9,4],[10,7,10,8],[10,0,10,2]]}
["LAKE VEGETATION INDEX (LVI) CALCULATOR\nBased on FDEP-SOP-002/01, LVI 2200 Vegetation Index\nCreated July 1, 2024"]
["Lake Name","Field ID","WIN Organization ID","WIN Station ID","Win Location Description","WBID","Sampling Date","Sampler #1","Sampler #2","Region","Notes"]
[{"$f":"'Site Info'!B2","v":"Low Lake"},{"$f":"'Site Info'!B7","v":0},{"$f":"'Site Info'!B4","v":"21FLA"},{"$f":"'Site Info'!B5","v":21020065},{"$f":"'Site Info'!B6","v":"LOWREF"},{"$f":"'Site Info'!B10","v":"00:00:00"},{"$f":"'Site Info'!B16","v":"00:00:00"},{"$f":"'Site Info'!B17&IF('Site Info'!C17=TRUE,\"*\",\"\")","v":"Test Testerson*"},{"$f":"'Site Info'!B18&IF('Site Info'!C18=TRUE,\"*\",\"\")","v":""},{"$f":"'LVI Taxa List'!J11","v":"North"},{"$f":"'LVI Taxa List'!K8","v":0}]
["Metric",{"$f":"B15&\" Metric Value\"","v":"Segment 1 Metric Value"},{"$f":"C15&\" Metric Value\"","v":"Segment 4 Metric Value"},{"$f":"D15&\" Metric Value\"","v":"Segment 7 Metric Value"},{"$f":"E15&\" Metric Value\"","v":"Segment 10 Metric Value"},"Regional Metric Score Equation",{"$f":"B15&\" Metric Score\"","v":"Segment 1 Metric Score"},{"$f":"C15&\" Metric Score\"","v":"Segment 4 Metric Score"},{"$f":"D15&\" Metric Score\"","v":"Segment 7 Metric Score"},{"$f":"E15&\" Metric Score\"","v":"Segment 10 Metric Score"}]
["% Native Taxa",{"$f":"SUM(COUNTIFS(B16:B2001,{\"d\",\"c\",\"p\"},$N$16:$N$2001,\"=1\",$G$16:$G$2001,\">0\"))/B9*100","v":84.210526315789465},{"$f":"SUM(COUNTIFS(C16:C2001,{\"d\",\"c\",\"p\"},$N$16:$N$2001,\"=1\",$G$16:$G$2001,\">0\"))/C9*100","v":91.666666666666657},{"$f":"SUM(COUNTIFS(D16:D2001,{\"d\",\"c\",\"p\"},$N$16:$N$2001,\"=1\",$G$16:$G$2001,\">0\"))/D9*100","v":86.666666666666671},{"$f":"SUM(COUNTIFS(E16:E2001,{\"d\",\"c\",\"p\"},$N$16:$N$2001,\"=1\",$G$16:$G$2001,\">0\"))/E9*100","v":88.888888888888886},{"$f":"VLOOKUP($J$3,DropDown!$F$2:$J$3,2,FALSE)","v":"(X-62.5)/37.5"},{"$f":"IF(VLOOKUP($J$3,DropDown!$E$7:$J$8,3,FALSE)<0,0,IF(VLOOKUP($J$3,DropDown!$E$7:$J$8,3,FALSE)>1,1,VLOOKUP($J$3,DropDown!$E$7:$J$8,3,FALSE)))","v":0.57894736842105243},{"$f":"IF(VLOOKUP($J$3,DropDown!$E$7:$J$8,4,FALSE)<0,0,IF(VLOOKUP($J$3,DropDown!$E$7:$J$8,4,FALSE)>1,1,VLOOKUP($J$3,DropDown!$E$7:$J$8,4,FALSE)))","v":0.77777777777777757},{"$f":"IF(VLOOKUP($J$3,DropDown!$E$7:$J$8,5,FALSE)<0,0,IF(VLOOKUP($J$3,DropDown!$E$7:$J$8,5,FALSE)>1,1,VLOOKUP($J$3,DropDown!$E$7:$J$8,5,FALSE)))","v":0.6444444444444446},{"$f":"IF(VLOOKUP($J$3,DropDown!$E$7:$J$8,6,FALSE)<0,0,IF(VLOOKUP($J$3,DropDown!$E$7:$J$8,6,FALSE)>1,1,VLOOKUP($J$3,DropDown!$E$7:$J$8,6,FALSE)))","v":0.70370370370370361}]
["% FLEPPC Taxa",{"$f":"SUM(COUNTIFS(B16:B2001,{\"d\",\"c\",\"p\"},$L$16:$L$2001,\"=1\",$G$16:$G$2001,\">0\"))/B9*100","v":15.789473684210526},{"$f":"SUM(COUNTIFS(C16:C2001,{\"d\",\"c\",\"p\"},$L$16:$L$2001,\"=1\",$G$16:$G$2001,\">0\"))/C9*100","v":8.3333333333333321},{"$f":"SUM(COUNTIFS(D16:D2001,{\"d\",\"c\",\"p\"},$L$16:$L$2001,\"=1\",$G$16:$G$2001,\">0\"))/D9*100","v":13.333333333333334},{"$f":"SUM(COUNTIFS(E16:E2001,{\"d\",\"c\",\"p\"},$L$16:$L$2001,\"=1\",$G$16:$G$2001,\">0\"))/E9*100","v":11.111111111111111},{"$f":"VLOOKUP($J$3,DropDown!$F$2:$J$3,3,FALSE)","v":"1-(X/30)"},{"$f":"IF(VLOOKUP($J$3,DropDown!$E$10:$J$11,3,FALSE)<0,0,IF(VLOOKUP($J$3,DropDown!$E$10:$J$11,3,FALSE)>1,1,VLOOKUP($J$3,DropDown!$E$10:$J$11,3,FALSE)))","v":0.47368421052631582},{"$f":"IF(VLOOKUP($J$3,DropDown!$E$10:$J$11,4,FALSE)<0,0,IF(VLOOKUP($J$3,DropDown!$E$10:$J$11,4,FALSE)>1,1,VLOOKUP($J$3,DropDown!$E$10:$J$11,4,FALSE)))","v":0.72222222222222232},{"$f":"IF(VLOOKUP($J$3,DropDown!$E$10:$J$11,5,FALSE)<0,0,IF(VLOOKUP($J$3,DropDown!$E$10:$J$11,5,FALSE)>1,1,VLOOKUP($J$3,DropDown!$E$10:$J$11,5,FALSE)))","v":0.55555555555555558},{"$f":"IF(VLOOKUP($J$3,DropDown!$E$10:$J$11,6,FALSE)<0,0,IF(VLOOKUP($J$3,DropDown!$E$10:$J$11,6,FALSE)>1,1,VLOOKUP($J$3,DropDown!$E$10:$J$11,6,FALSE)))","v":0.62962962962962965}]
{"$rows_left_out":34}
{"sheet":"4.Lake_Observation","index":5,"n_rows":90,"n_cols":49,"rows_kept":90,"cut":false,"hidden":false,"merged":[[12,32,13,37],[13,2,13,7],[13,8,13,11],[13,12,13,15],[6,37,6,48],[5,9,5,14],[5,2,5,8],[5,16,6,21],[11,39,13,48],[71,33,71,35],[67,31,68,45],[55,40,57,43],[56,44,56,47],[58,40,60,43],[69,3,69,4],[69,18,69,25],[71,3,71,5],[71,7,71,14],[71,18,71,22],[71,23,71,29],[58,2,60,5],[58,31,60,34],[59,7,59,29],[61,2,62,7],[61,8,62,15],[61,31,62,36],[62,18,62,23],[62,25,62,26],[13,29,13,31],[14,29,14,31],[14,33,14,36],[14,39,14,40],[14,41,14,46],[15,39,17,48],[3,2,3,4],[3,5,3,12],[3,24,3,28],[3,33,3,36],[3,37,3,48],[7,2,7,8],[7,9,7,32],[7,33,7,36],[7,37,7,48],[9,27,9,32],[9,33,9,48],[4,2,4,4],[4,5,4,12],[4,24,4,28],[4,33,4,36],[4,37,4,48],[5,22,5,48],[6,33,6,36],[14,3,14,6],[14,8,14,10],[14,12,14,15],[14,17,14,19],[14,21,14,23],[14,25,14,27],[13,16,13,20],[13,21,13,24],[13,25,13,28],[23,39,25,48],[24,2,24,7],[17,30,17,38],[20,2,20,11],[20,13,20,16],[20,19,20,20],[20,23,20,25],[20,28,20,29],[20,32,20,33],[22,1,22,8],[22,12,22,15],[22,21,22,24],[22,31,22,34],[22,41,22,43],[17,2,17,13],[17,15,17,16],[17,19,17,20],[17,23,17,25],[17,28,17,29],[26,29,26,30],[26,3,26,7],[26,9,26,10],[26,11,26,12],[26,13,26,14],[26,15,26,16],[26,17,26,18],[23,2,23,8],[23,9,25,18],[23,19,25,28],[23,29,25,38],[30,13,30,14],[30,15,30,16],[30,17,30,18],[26,43,26,44],[26,45,26,46],[26,47,26,48],[27,2,27,8],[27,9,29,18],[27,19,29,28],[27,29,29,38],[27,39,29,48],[28,2,28,7],[29,3,29,7],[26,31,26,32],[26,33,26,34],[26,35,26,36],[26,37,26,38],[26,39,26,40],[26,41,26,42],[26,19,26,20],[26,21,26,22],[26,23,26,24],[26,25,26,26],[26,27,26,28],[30,43,30,44],[30,45,30,46],[30,47,30,48],[31,2,31,8],[31,9,33,18],[31,19,33,28],[31,29,33,38],[31,39,33,48],[32,2,32,7],[30,31,30,32],[30,33,30,34],[30,35,30,36],[30,37,30,38],[30,39,30,40],[30,41,30,42],[30,19,30,20],[30,21,30,22],[30,23,30,24],[30,25,30,26],[30,27,30,28],[30,29,30,30],[30,3,30,7],[30,9,30,10],[30,11,30,12],[34,43,34,44],[34,45,34,46],[34,47,34,48],[37,2,37,5],[37,31,37,36],[37,39,37,41],[34,31,34,32],[34,33,34,34],[34,35,34,36],[34,37,34,38],[34,39,34,40],[34,41,34,42],[34,19,34,20],[34,21,34,22],[34,23,34,24],[34,25,34,26],[34,27,34,28],[34,29,34,30],[34,3,34,7],[34,9,34,10],[34,11,34,12],[34,13,34,14],[34,15,34,16],[34,17,34,18],[38,33,38,35],[38,37,38,40],[38,43,38,47],[40,3,40,11],[40,13,40,14],[40,17,40,18],[40,20,40,21],[40,22,40,26],[40,29,40,30],[38,3,38,11],[38,13,38,14],[38,17,38,18],[38,20,38,23],[38,25,38,26],[38,29,38,30],[42,39,42,41],[44,3,44,11],[44,13,44,14],[44,17,44,19],[44,33,44,36],[44,38,44,39],[44,41,44,42],[42,3,42,11],[42,13,42,14],[42,17,42,18],[42,20,42,22],[42,24,42,28],[42,31,42,37],[44,43,44,47],[47,2,47,5],[47,10,47,11],[47,13,47,14],[47,16,47,17],[47,18,47,21],[47,25,47,26],[47,37,47,38],[47,6,47,9],[47,22,47,24],[47,31,48,34],[47,40,48,43],[48,2,48,5],[48,7,48,8],[48,10,48,11],[48,13,48,14],[48,16,48,17],[48,19,48,20],[48,25,48,26],[48,21,48,23],[49,2,50,5],[49,7,49,8],[49,10,49,11],[49,13,49,14],[49,16,49,17],[49,19,49,20],[49,22,49,23],[49,25,49,26],[51,42,51,44],[51,2,51,5],[51,7,51,8],[51,10,51,11],[51,13,51,14],[51,16,51,17],[51,19,51,20],[51,22,51,23],[51,25,51,26],[51,46,52,48],[53,19,53,20],[53,22,53,23],[53,25,53,26],[53,33,53,39],[54,2,54,5],[55,31,57,34],[52,2,52,5],[53,2,53,5],[53,7,53,8],[53,10,53,11],[53,13,53,14],[53,16,53,17],[56,2,56,5],[56,7,56,8],[56,10,56,11],[56,13,56,14],[56,16,56,17],[56,19,56,20],[56,22,56,23],[56,25,56,26],[56,35,56,38],[51,33,51,35],[51,37,51,39],[75,31,75,33],[75,34,75,36],[75,37,86,48],[77,2,77,11],[63,3,63,4],[63,18,63,25],[63,33,63,35],[65,3,65,5],[65,7,65,14],[65,18,65,22],[65,23,65,29],[65,33,65,35],[67,2,68,7],[67,8,68,15],[76,21,77,26],[89,2,89,7],[89,8,89,36],[89,37,89,39],[89,40,89,47],[0,1,0,48],[1,1,2,48],[82,21,83,26],[83,2,83,13],[85,2,85,10],[85,18,85,20],[87,1,87,8],[88,1,88,48],[78,21,79,26],[79,2,79,11],[80,21,81,26],[81,2,81,4],[81,5,81,10],[81,11,81,14],[81,15,81,19],[73,2,74,13],[73,21,74,24],[73,37,74,48],[75,2,75,11],[75,27,75,28]]}
[null,"Instructions:  Fill in All Information in Blue Shaded Cells all other information is auto populated from other sheets."]
[null,"Lake Observations From DEP Form FD 9000-31: Lake Observation Field Sheet"]
[]
[null,null,"COUNTY:",null,null,{"$f":"'Site Info'!B8","v":"Dixie"},null,null,null,null,null,null,null,null,null,null,null,null,"WIN STATION ID:",null,null,null,null,null,{"$f":"'Site Info'!B4&\" \"&'Site Info'!B5","v":"21FLA 21020065"},null,null,null,null,null,null,null,null,"LATITUDE:",null,null,null,{"$f":"'Site Info'!B13","v":30.221693999999999}]
[null,null,"DATE:",null,null,{"$f":"'Site Info'!B15","v":"2025-07-29"},null,null,null,null,null,null,null,null,null,null,null,null,"TIME:",null,null,null,null,null,{"$f":"'Site Info'!B16","v":"00:00:00"},null,null,null,null,null,null,null,null,"LONGITUDE:",null,null,null,{"$f":"'Site Info'!B12","v":-82.836305999999993}]
[null,null,"SURVEY/PROJECT:",null,null,null,null,null,null,{"$f":"'Site Info'!B19","v":"TEST 1"},null,null,null,null,null,null,"SITE NAME AND DESCRIPTION:",null,null,null,null,null,{"$f":"'Site Info'!B2&\" \"&'Site Info'!B6","v":"Low Lake LOWREF"}]
{"$rows_left_out":85}
{"sheet":"5. Lake HA","index":6,"n_rows":34,"n_cols":24,"rows_kept":34,"cut":false,"hidden":false,"merged":[[32,1,32,2],[32,3,32,13],[33,1,33,2],[33,3,33,13],[28,1,28,2],[28,3,28,4],[25,14,25,18],[30,3,31,4],[30,5,31,23],[29,1,29,2],[29,3,29,8],[29,9,29,13],[29,14,29,18],[29,19,29,23],[25,19,25,23],[26,1,26,2],[26,3,26,4],[27,1,27,2],[27,3,27,23],[24,1,24,2],[24,3,24,4],[25,1,25,2],[25,3,25,8],[25,9,25,13],[21,19,21,23],[22,1,22,2],[22,3,22,4],[23,1,23,2],[23,3,23,8],[23,9,23,13],[23,14,23,18],[23,19,23,23],[21,14,21,18],[20,1,20,2],[20,3,20,4],[21,1,21,2],[21,3,21,8],[21,9,21,13],[17,14,17,18],[17,19,17,23],[18,1,18,2],[18,3,18,4],[19,1,19,2],[19,3,19,8],[19,9,19,13],[19,14,19,18],[19,19,19,23],[17,9,17,13],[15,1,15,2],[15,3,15,8],[16,1,16,2],[17,1,17,2],[17,3,17,8],[11,1,13,2],[11,3,12,8],[11,9,12,13],[11,14,12,18],[11,19,12,23],[13,3,13,8],[13,9,13,13],[13,14,13,18],[13,19,13,23],[14,1,14,2],[14,3,14,8],[14,9,14,13],[14,14,14,18],[14,19,14,23],[6,1,6,2],[6,3,6,8],[6,9,6,13],[6,19,6,23],[7,1,10,2],[7,3,9,8],[7,9,9,13],[7,14,9,18],[7,19,9,23],[6,14,6,18],[4,1,4,2],[4,3,4,8],[4,9,4,18],[4,19,4,23],[5,1,5,2],[5,3,5,4],[5,5,5,8],[5,9,5,12],[5,13,5,18],[5,19,5,20],[5,21,5,23],[1,1,1,23],[2,1,2,23],[3,1,3,2],[3,3,3,8],[3,9,3,18],[3,19,3,23]]}
[]
[null,"Lake Habitat Assessment"]
[null,"DEP Form FD 9000-6: Lake Habitat Assessment Field Sheet "]
[null,"WIN Station ID:",null,"Date",null,null,null,null,null,"Lake Name",null,null,null,null,null,null,null,null,null,"Field ID"]
[null,{"$f":"'Site Info'!B4&\" \"&'Site Info'!B5","v":"21FLA 21020065"},null,{"$f":"'Site Info'!B16","v":"00:00:00"},null,null,null,null,null,{"$f":"IF('Site Info'!B2=\"\",\"-\",'Site Info'!B2)","v":"Low Lake"},null,null,null,null,null,null,null,null,null,{"$f":"'Site Info'!B7","v":0}]
[null,"Eco-Region:",null,"County:",null,{"$f":"'Site Info'!B8","v":"Dixie"},null,null,null,"Sampling Location/Description:",null,null,null,{"$f":"'Site Info'!B6","v":"LOWREF"},null,null,null,null,null,"Lake Size:",null,{"$f":"'Site Info'!B10&\" \"&'Site Info'!B11","v":" "}]
{"$rows_left_out":29}
{"sheet":"6.Dominat Taxa Photos","index":7,"n_rows":12,"n_cols":3,"rows_kept":12,"cut":false,"hidden":false,"merged":[[2,0,3,0],[5,0,6,0],[8,0,9,0],[11,0,12,0],[0,0,0,2]]}
["FDEP SOP LVI 1100 3.2.8: Collect specimens of dominant and co-dominant taxa from groups which typically require further examination for identification  (e.g. grasses, submersed plants, “look-alike” species) for verification in the laboratory or by an independent taxonomist.  Take photos of dominant and co-dominant taxa which are easily identified and frequently encountered (e.g.Taxodium spp., Nymphaea odorata) and verify the ID; these do not need to be collected for verification."]
["Lake Section","Dominant/Co-dominant Taxa","Co-dominant Taxa"]
[{"$f":"'LVI Calculator'!B15","v":"Segment 1"},{"$f":"_xlfn.XLOOKUP(\"d\",'LVI Calculator'!$B$16:$B$2000,'LVI Calculator'!$A$16:$A$2000,_xlfn.XLOOKUP(\"c\",'LVI Calculator'!$B$16:$B$2000,'LVI Calculator'!$A$16:$A$2000,\"Dominant Taxa Not Identified\"))","v":"Eichhornia crassipes"},{"$f":"_xlfn.XLOOKUP(\"c\",'LVI Calculator'!$B$16:$B$2000,'LVI Calculator'!$A$16:$A$2000,\"No Co-Dominant Taxa Found\",0,-1)","v":"No Co-Dominant Taxa Found"}]
[]
[]
[{"$f":"'LVI Calculator'!C15","v":"Segment 4"},{"$f":"_xlfn.XLOOKUP(\"d\",'LVI Calculator'!$C$16:$C$2000,'LVI Calculator'!$A$16:$A$2000,_xlfn.XLOOKUP(\"c\",'LVI Calculator'!$C$16:$C$2000,'LVI Calculator'!$A$16:$A$2000,\"Dominant Taxa Not Identified\"))","v":"Eichhornia crassipes"},{"$f":"_xlfn.XLOOKUP(\"c\",'LVI Calculator'!$C$16:$C$2000,'LVI Calculator'!$A$16:$A$2000,\"No Co-Dominant Taxa Found\",0,-1)","v":"No Co-Dominant Taxa Found"}]
{"$rows_left_out":7}
{"sheet":"7.ExtenalBioFormat","index":8,"n_rows":9,"n_cols":16,"rows_kept":9,"cut":false,"hidden":false,"merged":[[4,5,4,14],[4,0,4,3]]}
["WIN ORGANIZATION ID","WIN STATION NUMBER","STATION NAME","STATION DESCRIPTION","PRIMARY TYPE","WATERBODY NAME","LATITUDE","LONGITUDE","SAMPLE DATE","METRIC","RESULT","FIELD COMMENT","COLLECTOR","METRIC PROFICIENCY","SAMPLING ENTITY","LAB NAME"]
[{"$f":"'Site Info'!B4","v":"21FLA"},{"$f":"'Site Info'!B5","v":21020065},{"$f":"'Site Info'!B7","v":0},{"$f":"'Site Info'!B8","v":"Dixie"},"Lake",{"$f":"'Site Info'!B2","v":"Low Lake"},{"$f":"'Site Info'!B13","v":30.221693999999999},{"$f":"'Site Info'!B12","v":-82.836305999999993},{"$f":"'Site Info'!$B$15","v":"2025-07-29"},"Habitat Assessment Score",{"$f":"'5. Lake HA'!B32","v":68},{"$f":"'5. Lake HA'!F31","v":0},{"$f":"IF('Site Info'!B17=0,\"-\",'Site Info'!B17&\" & \"&'Site Info'!B18)","v":"Test Testerson & "},"N/A",{"$f":"'Site Info'!B3","v":"Northeast District Biologists"},"na"]
[{"$f":"'Site Info'!B4","v":"21FLA"},{"$f":"'Site Info'!B5","v":21020065},{"$f":"'Site Info'!B7","v":0},{"$f":"'Site Info'!B8","v":"Dixie"},"Lake",{"$f":"'Site Info'!B2","v":"Low Lake"},{"$f":"'Site Info'!B13","v":30.221693999999999},{"$f":"'Site Info'!B12","v":-82.836305999999993},{"$f":"'Site Info'!$B$15","v":"2025-07-29"},"LVI_2012_Avg",{"$f":"'LVI Calculator'!J11","v":40.720776548402441},{"$f":"'LVI Calculator'!K3","v":0},{"$f":"IF('Site Info'!B17=0,\"-\",'Site Info'!B17&\" & \"&'Site Info'!B18)","v":"Test Testerson & "},{"$f":"IF(OR('Site Info'!C17=TRUE,'Site Info'!C18=TRUE),\"Yes\")","v":"Yes"},{"$f":"'Site Info'!B3","v":"Northeast District Biologists"},"na"]
[]
["↑ All values above are auto populated from the values entered or calculated on the other worksheets.\n\nThere is no need to enter\nanything on this sheet!",null,null,null,null,"Submitting Bioassessment Data\nData providers who would like to submit LVI data to help support the Department's Impaired Waters assessment can copy the auto calculated values in this worksheet into the Watershed Assessment Sections Bioassessment Data Template.\n\nThe department is requesting external data providers who would like to submit applicable bioassessment data to help support the department's Impaired Waters assessment. Please download and complete the Bioassessment Data Template, available as a Microsoft Excel worksheet (.xlsx). Once the template has been completed with the required information, please submit the worksheet and any supporting documentation (field sheets, photos, etc.) by email to Jessica Mostyn.​​​​​​​​​​​​\n\nEntities submitting data to DEP must meet the applicable bioassessment proficiency demonstrations set forth on the Bioassessment Training, Evaluation and Quality Assurance Web Page, follow the department's Quality Assurance requirements for field activities as codified in Chapter 62-160, Florida Administrative Code (F.A.C.), and the incorporated DEP Standard Operating Procedures.  For external bioassessment data to be considered as part of the assessment, data providers must be in the applicable Active status for LVI, BioRecon, SCI and/or Habitat Assessment certification at the time of sample collection.  While the online RPS and LVS tests are not required, because there are currently no certifications for these methods, taking the online tests are highly recommended to show proficiency."]
[null,null,null,null,null,"References"]
{"$rows_left_out":3}