{"text_format":"1","workbook":"xlsx","n_sheets":9,"sheets":["DropDown","Read Me","Site Info","LVI Taxa List","LVI Calculator","4.Lake_Observation","5. Lake HA","6.Dominat Taxa Photos","7.ExtenalBioFormat"],"not_rendered":{"charts":0,"images":1,"macros":1,"external_links":0,"defined_names":7,"comments":0,"pivot_tables":0},"unopened":[],"bounds":{"document_bytes":16777216,"sheet_cells":100000,"rows_first":2000,"rows_last":500,"rows_between":2000,"halvings":0,"cell_chars":16384,"cell_head_chars":4096},"cells_cut":0,"cells_raw":0,"read":"whole","date_system":"1900"}

{"sheet":"DropDown","index":0,"n_rows":69,"n_cols":30,"rows_kept":69,"cut":false,"hidden":true,"merged":[]}
["COUNTY","Region",null,"Segments",null,null,"% Native Taxa","% FLEPPC Taxa","% Sensitive Taxa","Dominant Taxa C of C",null,"Area Units",null,null,null,null,"Level III","Level III Name",null,"Level IV","Level IV Name",null,null,"VOB"]
["Alachua","North",null,"1, 4, 7, 10",null,"North","(X-62.5)/37.5","1-(X/30)","X/27.78","X/7.91",null,"km2",null,null,"65-Southeastern Plains","t2:u12",65,"Southeastern Plains",null,"65f","Southern Pine Plains and Hills",null,null,20,null,null,"native taxa","flnative",1]
["Baker","North",null,"2, 5, 8, 11",null,"South","(X-66.67)/25.89","1-(X/30)","X/20","X/7.0",null,"hectares",null,null,"75-Southern Coastal Plain","t13:u23",65,"Southeastern Plains",null,"65g","Dougherty Plain",null,null,19,null,null,null,null,"wetlansstatus","3, 4, 5, 8, 9"]
["Bay","North",null,"3, 6, 9, 12",null,null,null,null,null,null,null,"m2",null,null,"76-Southern Florida Coastal Plain","t24:u34",65,"Southeastern Plains",null,"65h","Tifton Upland",null,null,18,null,null,null,"or","taxia ID",18036]
["Bradford","North",null,"Required",null,null,null,null,null,null,null,"mi2",null,null,null,null,65,"Southeastern Plains",null,"65o","Tallahasee Hills/Valdosta Limesink",null,null,17]
["Brevard","Must Enter Lattitiude",null,null,null,"Metric",{"$f":"'LVI Calculator'!B15","v":"Segment 1"},{"$f":"'LVI Calculator'!C15","v":"Segment 4"},{"$f":"'LVI Calculator'!D15","v":"Segment 7"},{"$f":"'LVI Calculator'!E15","v":"Segment 10"},null,"acres",null,null,null,null,65,"Southeastern Plains",null,"65p","Southeastern Floodplains and Low Terraces",null,null,16,null,null,null,"or","growthhabit",7]
["Broward","South",null,null,"North","% Native Taxa",{"$f":"('LVI Calculator'!B5-62.5)/37.5","v":0.57894736842105243},{"$f":"('LVI Calculator'!C5-62.5)/37.5","v":0.77777777777777757},{"$f":"('LVI Calculator'!D5-62.5)/37.5","v":0.6444444444444446},{"$f":"('LVI Calculator'!E5-62.5)/37.5","v":0.70370370370370361},null,"ft2",null,null,null,null,75,"Southern Coastal Plain",null,"-","-",null,null,15]
["Calhoun","North",null,null,"South","% Native Taxa",{"$f":"('LVI Calculator'!B5-66.67)/25.89","v":0.67750198206989043},{"$f":"('LVI Calculator'!C5-66.67)/25.89","v":0.96549504313119561},{"$f":"('LVI Calculator'!D5-66.67)/25.89","v":0.7723702845371444},{"$f":"('LVI Calculator'!E5-66.67)/25.89","v":0.85820351057894495},null,null,null,null,null,null,75,"Southern Coastal Plain",null,"-","-",null,null,14]
["Charlotte","South",null,null,null,null,null,null,null,null,null,null,null,null,null,null,75,"Southern Coastal Plain",null,"-","-",null,null,13]
["Citrus","North",null,null,"North","% FLEPPC Taxa",{"$f":"1-('LVI Calculator'!B6/30)","v":0.47368421052631582},{"$f":"1-('LVI Calculator'!C6/30)","v":0.72222222222222232},{"$f":"1-('LVI Calculator'!D6/30)","v":0.55555555555555558},{"$f":"1-('LVI Calculator'!E6/30)","v":0.62962962962962965},null,null,null,null,null,null,75,"Southern Coastal Plain",null,"-","-",null,null,12]
["Clay","North",null,null,"South","% FLEPPC Taxa",{"$f":"1-('LVI Calculator'!B6/30)","v":0.47368421052631582},{"$f":"1-('LVI Calculator'!C6/30)","v":0.72222222222222232},{"$f":"1-('LVI Calculator'!D6/30)","v":0.55555555555555558},{"$f":"1-('LVI Calculator'!E6/30)","v":0.62962962962962965},null,{"$f":"IF('Site Info'!B23=\"65-Southeastern Plains\",INDIRECT(DropDown!P2),IF('Site Info'!B23=\"75-Southern Coastal Plain\",INDIRECT(DropDown!P3),INDIRECT(DropDown!P4)))","v":"76a"},"Everglades",{"$f":"L11&\" - \"&M11","v":"76a - Everglades"},null,null,75,"Southern Coastal Plain",null,"-","-",null,null,11]
["Collier","South",null,null,null,null,null,null,null,null,null,"76b","Big Cypress",{"$f":"L12&\" - \"&M12","v":"76b - Big Cypress"},null,null,75,"Southern Coastal Plain",null,"-","-",null,null,10]
["Columbia","North",null,null,"North","% Sensitive Taxa",{"$f":"'LVI Calculator'!B7/27.78","v":0.18945852752832401},{"$f":"'LVI Calculator'!C7/27.78","v":0.59995200383969272},{"$f":"'LVI Calculator'!D7/27.78","v":0.23998080153587714},{"$f":"'LVI Calculator'!E7/27.78","v":0.3999680025597952},null,"76c","Miami Ridge/Atlantic Coastal Strip","76c - Miami Ridge/Atlantic Coastal Strip",null,null,75,"Southern Coastal Plain",null,"75a","Gulf Coast Flatwoods",null,null,9]
["Dade","South",null,null,"South","% Sensitive Taxa",{"$f":"'LVI Calculator'!B7/20","v":0.26315789473684209},{"$f":"'LVI Calculator'!C7/20","v":0.83333333333333326},{"$f":"'LVI Calculator'!D7/20","v":0.33333333333333337},{"$f":"'LVI Calculator'!E7/20","v":0.55555555555555558},null,"76d","Southern Coast and Islands","76d - Southern Coast and Islands",null,null,75,"Southern Coastal Plain",null,"75b","Southwestern Florida Flatwoods",null,null,8]
["DeSoto","South",null,null,null,null,null,null,null,null,null,"-","-","- - -",null,null,75,"Southern Coastal Plain",null,"75c","Central Florida Ridges and Uplands",null,null,7]
["Dixie","North",null,null,"North","Dominant Taxa C of C",{"$f":"IF('LVI Calculator'!B8=\"\",\"\",'LVI Calculator'!B8/7.91)","v":0},{"$f":"IF('LVI Calculator'!C8=\"\",\"\",'LVI Calculator'!C8/7.91)","v":0},{"$f":"IF('LVI Calculator'!D8=\"\",\"\",'LVI Calculator'!D8/7.91)","v":0},{"$f":"IF('LVI Calculator'!E8=\"\",\"\",'LVI Calculator'!E8/7.91)","v":0},null,"-","-","- - -",null,null,75,"Southern Coastal Plain",null,"75d","Eastern Florida Flatwoods",null,null,6]
["Duval","North",null,null,"South","Dominant Taxa C of C",{"$f":"IF('LVI Calculator'!B8=\"\",\"\",'LVI Calculator'!B8/7)","v":0},{"$f":"IF('LVI Calculator'!C8=\"\",\"\",'LVI Calculator'!C8/7)","v":0},{"$f":"IF('LVI Calculator'!D8=\"\",\"\",'LVI Calculator'!D8/7)","v":0},{"$f":"IF('LVI Calculator'!E8=\"\",\"\",'LVI Calculator'!E8/7)","v":0},null,"-","-","- - -",null,null,75,"Southern Florida Coastal Plain",null,"75e","Okefenokee Plains",null,null,5]
["Escambia","North",null,null,null,null,null,null,null,null,null,"-","-","- - -",null,null,76,"Southern Florida Coastal Plain",null,"75f","Sea Island Flatwoods",null,null,4]
["Flagler","North",null,null,null,null,null,null,null,null,null,"-","-","- - -",null,null,76,"Southern Florida Coastal Plain",null,"75g","Okefenokee Swamps",null,null,3]
["Franklin","North",null,null,null,null,null,null,null,null,null,"-","-","- - -",null,null,76,"Southern Florida Coastal Plain",null,"75i","Floodplains and Low Terraces",null,null,2]
["Gadsden","North",null,null,null,null,null,null,null,null,null,"-","-","- - -",null,null,76,"Southern Florida Coastal Plain",null,"75j","Sea Islands/Coastal Marsh",null,null,1]
["Gilchrist","North",null,null,null,null,null,null,null,null,null,null,null,null,null,null,"-","-",null,"75k","Gulf Barrier Islands and Coastal Marshes",null,null,"-"]
["Glades","South",null,null,null,null,null,null,null,null,null,null,null,null,null,null,null,null,null,"75l","Big Bend Coastal Marsh"]
["Gulf","North",null,null,null,null,null,null,null,null,null,null,null,null,null,null,null,null,null,"76a","Everglades"]
["Hamilton","North",null,null,null,null,null,null,null,null,null,null,null,null,null,null,null,null,null,"76b","Big Cypress"]
["Hardee","South",null,null,null,null,null,null,null,null,null,null,null,null,null,null,null,null,null,"76c","Miami Ridge/Atlantic Coastal Strip"]
["Hendry","South",null,null,null,null,null,null,null,null,null,null,null,null,null,null,null,null,null,"76d","Southern Coast and Islands"]
["Hernando","North",null,null,null,null,null,null,null,null,null,null,null,null,null,null,null,null,null,"-","-"]
["Highlands","South",null,null,null,null,null,null,null,null,null,null,null,null,null,null,null,null,null,"-","-"]
["Hillsborough","South",null,null,null,null,null,null,null,null,null,null,null,null,null,null,null,null,null,"-","-"]
["Holmes","North",null,null,null,null,null,null,null,null,null,null,null,null,null,null,null,null,null,"-","-"]
["Indian River","South",null,null,null,null,null,null,null,null,null,null,null,null,null,null,null,null,null,"-","-"]
["Jackson","North",null,null,null,null,null,null,null,null,null,null,null,null,null,null,null,null,null,"-","-"]
["Jefferson","North",null,null,null,null,null,null,null,null,null,null,null,null,null,null,null,null,null,"-","-"]
["Lafayette","North"]
["Lake","North"]
["Lee","South"]
["Leon","North"]
["Levy","North"]
["Liberty","North"]
["Madison","North"]
["Manatee","South"]
["Marion","North"]
["Martin","South"]
["Monroe","South"]
["Nassau","North"]
["Okaloosa","North"]
["Okeechobee","South"]
["Orange","North"]
["Osceola","South"]
["Palm Beach","South"]
["Pasco","North"]
["Pinellas","South"]
["Polk","South"]
["Putnam","North"]
["Santa Rosa","North"]
["Sarasota","South"]
["Seminole","North"]
["St. Johns","North"]
["St. Lucie","South"]
["Sumter","North"]
["Suwannee","North"]
["Taylor","North"]
["Union","North"]
["Volusia","North"]
["Wakulla","North"]
["Walton","North"]
["Washington","North"]
["Required"]

{"sheet":"Read Me","index":1,"n_rows":11,"n_cols":1,"rows_kept":11,"cut":false,"hidden":false,"merged":[[8,0,8,10],[10,0,10,10],[0,0,0,10],[1,0,1,10],[2,0,2,10],[4,0,4,10],[5,0,5,10],[6,0,6,10]]}
["LAKE VEGETATION INDEX (LVI) CALCULATOR"]
["Based on FDEP-SOP-003/11 (Revision Date January 2017), LVI 2200 \"Lake Vegetation Index Determination\"\nCalculator Created July 2024"]
["Definition: The LVI is a regional multimetric biological assessment of lake health using the aquatic plant community to determines how closely a lake’s flora resembles that of an undisturbed lake.  The LVI field method and calculations are described in “Assessing the Biological Condition of Florida Lakes:  Development of the Lake Vegetation Index (LVI), 2007 Fore, Leska S.,” with updates in the calculations described in “Development of Aquatic Life Use Support Attainment Thresholds for Florida’s Stream Condition Index and Lake Vegetation Index, DEP-SAS-003/11.”  All LVI sampling and analysis shall be conducted according to the requirements of this LVI method and the LVI Primer (Sampling and Use of the Lake Vegetation Index (LVI) for Assessing Lake Plant Communities in Florida: A Primer [DEP-SAS-002/11; May 20, 2026]).  In order to submit LVI data to DEP, sampling teams must demonstrate competency per the requirements in LVI 1200. All team members must take and pass the LVI method test, and pass the team testing exercise. Each team shall contain at least one individual who maintains “pass status” for the plant identification test per LVI 1200.  Sampling for the LVI should be conducted from April 1 to November 30 in the South LVI region and May 1 to October 31 in the North LVI region. Each macrophyte taxon observed in each of four (4) lake segments is identified to the lowest practical taxonomic level as described in the LVI Primer.  Those data are then entered on the LVI Taxa List tab of the calculator to calculate the LVI."]
[]
["Index Calculation:  The LVI has four (4) metrics: \n1) Percent Native taxa \n2) Percent FISC Category 1 Invasive Species \n3) Percent Sensitive Taxa \n4) Coefficient of Conservatism (C of C) score for Dominant Taxa"]
["A score for each of the four metrics is calculated for each of the four lake segments based on the macrophyte taxa present in the segment.  The four metric scores for each segment are averaged to give a LVI score for the segment.  The four segment LVI scores are then averaged to get the final LVI score for the lake."]
["The equations used to calculate the individual LVI metric scores are regionalized. Therefore, the county and possibly latitude must be specified in the calculator to determine the appropriate region and obtain accurate results. "]
[]
["More details concerning the LVI and its calculation can be found in SOP LVI 2000 (wihtin LVI 1000). "]
[]
["To use the calculator, go to the \"Site Info\" tab (press button on right or select tab at bottom) and enter the requested information about the lake sampled.  After you have entered the Site Information, go to the  \"LVI Taxa List\" tab and follow the instructions at the top of the sheet to select taxa found in each lake segment. "]

{"sheet":"Site Info","index":2,"n_rows":32,"n_cols":10,"rows_kept":32,"cut":false,"hidden":false,"merged":[[27,0,27,2],[25,1,25,2],[1,4,1,10],[28,0,28,1],[0,0,0,2],[22,1,22,2],[23,1,23,2],[24,1,24,2],[1,1,1,2],[3,1,3,2],[2,1,2,2],[18,1,18,2]]}
["Please Enter Site Information in Shaded Fields Below As Described"]
["Lake Name","Low Lake",null,null,"Geographic Coordinate Converter"]
["Sampling Entity","Northeast District Biologists",null,null,"x/y","Degrees","Minutes","Seconds",null,"Decimal Degrees"]
["WIN Organization ID","21FLA",null,null,"LATITUDE",30,13,18,null,{"$f":"IF(F4<0,(F4-(G4/60)-(H4/3600)),(1*(F4+(G4/60)+(H4/3600))))","v":30.221666666666664}]
["WIN Station ID",21020065,null,null,"LONGITUDE",82,50,10,null,{"$f":"IF(F5<0,(F5-(G5/60)-(H5/3600)),(-1*(F5+(G5/60)+(H5/3600))))","v":-82.836111111111109}]
["WIN Sampling Location Description","LOWREF"]
["Field ID",null,null,"Optional"]
["County","Dixie",null,"Dropdown Menu"]
["WBID","3496A"]
["Lake Size (area)",null,null,"(Optional)"]
["Lake Size (units)",null,null,"(Optional) Dropdown Menu"]
["Longitude (Decimal Degrees)",-82.836305999999993]
["Latitude (Decimal Degrees)",30.221693999999999,null,"Required for LVI Calculation"]
["LVI Region",{"$f":"IF(B8=\"\",\"Must Enter County\",IF(AND(B8=\"Brevard\",OR(B13=0,ISBLANK(B13),ISTEXT(B13))),\"Must Enter Lattitiude\",IF(AND(B8=\"Brevard\",B13>=28.348),\"North\",IF(AND(B8=\"Brevard\",B13<28.348),\"South\",VLOOKUP(B8,DropDown!A2:B68,2,FALSE)))))","v":"North"},null,"Autopopulated"]
["Sample Date","2025-07-29"]
["Sample Time"]
["Sampler 1 Name (Check box to right if proficient* in LVI method)","Test Testerson",true]
["Sampler 2 Name (Check box to right if proficient* in LVI method)",null,false]
["Survey/Project","TEST 1"]
[]
[]
[]
["Level III Eco Region",null,null,"(Optional)"]
["Level IV Eco Region",null,null,"(Optional)"]
["Level IV Eco Region Name",{"$f":"IF(ISBLANK(B24),\"\",RIGHT(B24,LEN(B24)-6))","v":""},null,"(Optional) Autopopulated"]
["Analyst (Person entering data)"]
[]
["*Proficient: An individual that is in pass status with DEP for the LVI method.  Pass status required passing the infield team testing every 2 years and passing the online plant test annually."]
["Check Proficiency status at the FDP Bioassessment Proficiency Registry Page."]
[]
["Per DEP-SOP-003/11, LVI 1000. Lake Vegetation Index Determination. Effective date May 20, 2026.             "]
["Per DEP-SAS-002/11, Sampling and Use of the Lake Vegetation Index (LVI) for Assessing Lake Plant Communities in Florida: A Primer, May 20, 2026."]

{"sheet":"LVI Taxa List","index":3,"n_rows":1522,"n_cols":20,"rows_kept":1522,"cut":false,"hidden":false,"merged":[[6,10,6,12],[11,0,11,1],[1,0,1,12],[2,0,2,12],[3,0,3,12],[4,0,4,12],[6,2,6,3],[7,2,7,3],[6,6,6,7],[7,6,7,7],[6,4,6,5],[7,4,7,5],[12,10,12,13],[12,2,12,5],[9,2,9,3],[10,2,10,3],[8,0,8,9],[12,6,12,9],[11,9,11,12],[7,10,10,12],[0,0,0,9],[10,4,10,5],[10,6,10,7],[9,4,9,5],[9,6,9,7]]}
["LAKE VEGETATION INDEX (LVI) CALCULATOR\nBased on FDEP-SOP-002/01, LVI 2200 Vegetation Index\nCreated July 1, 2024"]
["1) Start by pressing the \"Clear Previous Data Entries\" button to clear all data previously entered and taxa selected."]
["2) Select lake segments sampled.  Other site information automatically copied from Site Info tab."]
["3) Then for each of the four lake segments sampled, select all macrophyte taxa present in the segment by entering   \"D\" to denote a Dominant taxa, \n\"C\" to denote Co-Dominant Taxa, or a \"P\" to identify all other taxa present in columns C through F, respectively.  Only one dominant or two co-dominant\n taxa are allowed per segment.  (If a Taxa is not found in Column A, also search in the Column B as a synonym.) "]
["4) When all the appropriate taxa have been identified, press the \"Calculate LVI\" button to calculate the Lake Vegetation index Value."]
[]
["Lake Name","Field ID","WIN Organization ID",null,"WIN Station ID",null,"WIN Sampling Location Description",null,"WBID","Sample Date","Notes: "]
[{"$f":"'Site Info'!B2","v":"Low Lake"},{"$f":"'Site Info'!B7","v":0},{"$f":"'Site Info'!B4","v":"21FLA"},null,{"$f":"'Site Info'!B5","v":21020065},null,{"$f":"'Site Info'!B6","v":"LOWREF"},null,{"$f":"'Site Info'!B9","v":"3496A"},{"$f":"'Site Info'!B15","v":"2025-07-29"}]
[]
["Sampler #1\n (* = Proficient)","Sampler #2\n (* = Proficient)","Sections Sampled",null,"Longitude\n (Decimal Degrees)",null,"Latitude\n (Decimal Degrees)",null,"County","Region"]
[{"$f":"'Site Info'!B17&IF('Site Info'!C17=TRUE,\"*\",\"\")","v":"Test Testerson*"},{"$f":"'Site Info'!B18&IF('Site Info'!C18=TRUE,\"*\",\"\")","v":""},"1, 4, 7, 10",null,{"$f":"'Site Info'!B12","v":-82.836305999999993},null,{"$f":"'Site Info'!B13","v":30.221693999999999},null,{"$f":"'Site Info'!B8","v":"Dixie"},{"$f":"IF(I11=0,\"Must Enter County\",IF(AND(I11=\"Brevard\",OR(G11=0,ISBLANK(G11),ISTEXT(G11))),\"Must Enter  Lattitiude\",IF(AND(I11=\"Brevard\",G11>=28.348),\"North\",IF(AND(I11=\"Brevard\",G11<28.348),\"South\",VLOOKUP(I11,DropDown!A2:B68,2,FALSE)))))","v":"North"}]
["Total Taxa / Dominant Taxa / Co-Dominant Taxa",null,{"$f":"SUM(COUNTIFS(C16:C2000,{\"p\",\"c\",\"d\"}))&\" / \"& COUNTIFS(C16:C2000,\"d\")&\" / \"& COUNTIFS(C16:C2000,\"c\")","v":"19 / 1 / 0"},{"$f":"SUM(COUNTIFS(D16:D2000,{\"p\",\"c\",\"d\"}))&\" / \"& COUNTIFS(D16:D2000,\"d\")&\" / \"& COUNTIFS(D16:D2000,\"c\")","v":"12 / 1 / 0"},{"$f":"SUM(COUNTIFS(E16:E2000,{\"p\",\"c\",\"d\"}))&\" / \"& COUNTIFS(E16:E2000,\"d\")&\" / \"& COUNTIFS(E16:E2000,\"c\")","v":"15 / 1 / 0"},{"$f":"SUM(COUNTIFS(F16:F2000,{\"p\",\"c\",\"d\"}))&\" / \"& COUNTIFS(F16:F2000,\"d\")&\" / \"& COUNTIFS(F16:F2000,\"c\")","v":"18 / 1 / 0"},null,null,null,{"$f":"IF(AND(J11=\"North\",OR(MONTH(J8)<4,MONTH(J8)>11)),\"Sample Date is Outside Index Period for the LVI!\",IF(AND(J11=\"South\",OR(MONTH(J8)<5,MONTH(J8)>10)),\"Sample Date is Outside Index Period for the LVI!\",\"\"))","v":""}]
[null,null,"For each segment below, Use \"D\" to denote Dominant taxa, \"C\" to denote Co-Dominant Taxa, and \"P\" to Identify all other taxa present.",null,null,null,{"$f":"IF(SUM(G16:G2002)=0,\"No Taxa have been Selected\", IF(OR(COUNTIFS(C16:C2002,\"c\")>2,COUNTIFS(C16:C2002,\"d\")>1,SUM(COUNTIFS(C16:C2002,{\"C\",\"d\"})>2),AND(COUNTIFS(C16:C2002,\"d\")>0,COUNTIFS(C16:C2002,\"c\")>0)),\"Too Many Dominant and/or Co-Dominant Taxa Selected in 1st Segment\", IF(OR(COUNTIFS(D16:D2002,\"c\")>2,COUNTIFS(D16:D2002,\"d\")>1,SUM(COUNTIFS(D16:D2002,{\"c\",\"d\"})>2),AND(COUNTIFS(D16:D2002,\"d\")>0,COUNTIFS(D16:D2002,\"c\")>0)),\"Too Many Dominant and/or Co-Dominant Taxa Selected in 2nd Segment\", IF(OR(COUNTIFS(E16:E2002,\"c\")>2,COUNTIFS(E16:E2002,\"d\")>1,SUM(COUNTIFS(E16:E2002,{\"c\",\"d\"})>2),AND(COUNTIFS(E16:E2002,\"d\")>0,COUNTIFS(E16:E2002,\"c\")>0)),\"Too Many Dominant and/or Co-Dominant Taxa Selected in 3rd Segment\", IF(OR(COUNTIFS(F16:F2002,\"c\")>2,COUNTIFS(F16:F2002,\"d\")>1,SUM(COUNTIFS(F16:F2002,{\"c\",\"d\"})>2),AND(COUNTIFS(F16:F2002,\"d\")>0,COUNTIFS(F16:F2002,\"c\")>0)),\"Too Many Dominant and/or Co-Dominant Taxa Selected in 4th Segment\",\"\")))))","v":""}]
[]
["Taxon","Synonym(s)",{"$f":"IF($C$11=\"1, 4, 7, 10\",\"Segment 1\",IF($C$11=\"2, 5, 8, 11\",\"Segment 2\",IF($C$11=\"3, 6, 9, 12\",\"Segment 3\",\"Select Segments\")))","v":"Segment 1"},{"$f":"IF($C$11=\"1, 4, 7, 10\",\"Segment 4\",IF($C$11=\"2, 5, 8, 11\",\"Segment 5\",IF($C$11=\"3, 6, 9, 12\",\"Segment 6\",\"Select Segments\")))","v":"Segment 4"},{"$f":"IF($C$11=\"1, 4, 7, 10\",\"Segment 7\",IF($C$11=\"2, 5, 8, 11\",\"Segment 8\",IF($C$11=\"3, 6, 9, 12\",\"Segment 9\",\"Select Segments\")))","v":"Segment 7"},{"$f":"IF($C$11=\"1, 4, 7, 10\",\"Segment 10\",IF($C$11=\"2, 5, 8, 11\",\"Segment 11\",IF($C$11=\"3, 6, 9, 12\",\"Segment 12\",\"Select Segments\")))","v":"Segment 10"},"Occurrences","Occurrences of LVI Taxon","C of C Score","FLEPPC Status","Wetland Status","Nativity","FLEPPC Code","Wetland Status Code","TAXAID","FL Native","Growth Habit","HERB WOOD",null,"Occurrences"]
["Abildgaardia ovata",null,null,null,null,null,{"$f":"SUM(COUNTIFS(C16:F16,{\"P\",\"C\",\"D\"}))","v":0},{"$f":"IF(OR(N16=3,N16=4,N16=5,N16=8,N16=9,Q16=7,O16=18036),G16,0)","v":0},-9,"Not Listed","FACW","Native",3,4,40283,1,2,1,null,">0"]
["Acalypha gracilens",null,null,null,null,null,{"$f":"SUM(COUNTIFS(C17:F17,{\"P\",\"C\",\"D\"}))","v":0},0,3.29,"Not Listed",null,"Native",3,-9,28183,1,null,1]
["Acer",null,null,null,null,null,{"$f":"SUM(COUNTIFS(C18:F18,{\"P\",\"C\",\"D\"}))","v":0},0,-9,"Not Listed",null,"Native",3,1,28727,1,6,2]
["Acer barbatum",null,null,null,null,null,{"$f":"SUM(COUNTIFS(C19:F19,{\"P\",\"C\",\"D\"}))","v":0},0,7.7,"Not Listed",null,"Native",3,1,28759,1,6,2]
["Acer rubrum",null,"P","P","P","P",{"$f":"SUM(COUNTIFS(C20:F20,{\"P\",\"C\",\"D\"}))","v":4},4,4.6500000000000004,"Not Listed","FACW","Native",3,4,28728,1,6,2]
["Acer saccharinum",null,null,null,null,null,{"$f":"SUM(COUNTIFS(C21:F21,{\"P\",\"C\",\"D\"}))","v":0},0,6.89,"Not Listed","OBL","Native",3,5,28757,1,6,2]
["Acmella",null,null,null,null,null,{"$f":"SUM(COUNTIFS(C22:F22,{\"P\",\"C\",\"D\"}))","v":0},0,-9,"Not Listed","Var Genus",-9,3,9,10010771,-9,1,1]
["Acmella oppositifolia","Spilanthes americana",null,null,null,null,{"$f":"SUM(COUNTIFS(C23:F23,{\"P\",\"C\",\"D\"}))","v":0},0,3,"Not Listed","FAC","Native",3,3,10010671,1,1,1]
["Acmella oppositifolia repens",null,null,null,null,null,{"$f":"SUM(COUNTIFS(C24:F24,{\"P\",\"C\",\"D\"}))","v":0},0,3,"Not Listed","FAC","Native",3,3,10016088,1,1,1]
["Acrostichum",null,null,null,null,null,{"$f":"SUM(COUNTIFS(C25:F25,{\"P\",\"C\",\"D\"}))","v":0},0,null,-9,null,-9,-9,-9,17304,-9,-9,-9]
["Acrostichum danaeifolium",null,null,null,null,null,{"$f":"SUM(COUNTIFS(C26:F26,{\"P\",\"C\",\"D\"}))","v":0},0,5.79,"Not Listed","OBL","Native",3,5,17306,1,1,1]
["Aeschynomene",null,null,null,null,null,{"$f":"SUM(COUNTIFS(C27:F27,{\"P\",\"C\",\"D\"}))","v":0},0,null,-9,null,-9,-9,-9,25358,-9,-9,-9]
["Aeschynomene americana",null,null,null,null,null,{"$f":"SUM(COUNTIFS(C28:F28,{\"P\",\"C\",\"D\"}))","v":0},0,2.4700000000000002,"Not Listed",null,"Native",3,1,25360,1,1,1]
["Aeschynomene fluitans",null,null,null,null,null,{"$f":"SUM(COUNTIFS(C29:F29,{\"P\",\"C\",\"D\"}))","v":0},0,-9,"Not Listed","OBL","Exotic",3,8,10015748,2,1,1]
["Aeschynomene indica",null,null,null,null,null,{"$f":"SUM(COUNTIFS(C30:F30,{\"P\",\"C\",\"D\"}))","v":0},0,0.49,"Not Listed","FACW","Exotic",3,4,25362,2,1,1]
["Agalinis",null,null,null,null,null,{"$f":"SUM(COUNTIFS(C31:F31,{\"P\",\"C\",\"D\"}))","v":0},0,-9,"Not Listed",null,"Native",3,1,33006,1,1,1]
["Agalinis fasciculata",null,null,null,null,null,{"$f":"SUM(COUNTIFS(C32:F32,{\"P\",\"C\",\"D\"}))","v":0},0,4.17,"Not Listed","FACW","Native",3,4,33021,1,1,1]
["Agalinis filifolia",null,null,null,null,null,{"$f":"SUM(COUNTIFS(C33:F33,{\"P\",\"C\",\"D\"}))","v":0},0,6.69,"Not Listed","UPL","Native",3,2,33023,1,1,1]
["Agalinis linifolia",null,null,null,null,null,{"$f":"SUM(COUNTIFS(C34:F34,{\"P\",\"C\",\"D\"}))","v":0},0,7.04,"Not Listed","OBL","Native",3,5,33028,1,1,1]
["Agalinis obtusifolia",null,null,null,null,null,{"$f":"SUM(COUNTIFS(C35:F35,{\"P\",\"C\",\"D\"}))","v":0},0,6.5,"Not Listed",null,"Native",3,-9,33029,1,null,1]
["Agarista populifolia",null,null,null,null,null,{"$f":"SUM(COUNTIFS(C36:F36,{\"P\",\"C\",\"D\"}))","v":0},0,7.7,"Not Listed","FACW","Native",3,4,23624,1,4,2]
["Albizia",null,null,null,null,null,{"$f":"SUM(COUNTIFS(C37:F37,{\"P\",\"C\",\"D\"}))","v":0},0,-9,"Split Genus",null,-9,4,1,26448,-9,6,2]
["Albizia julibrissin",null,null,null,null,null,{"$f":"SUM(COUNTIFS(C38:F38,{\"P\",\"C\",\"D\"}))","v":0},0,0,"Category 1","UPL","Exotic",1,2,26449,2,6,2]
["Aleurites",null,null,null,null,null,{"$f":"SUM(COUNTIFS(C39:F39,{\"P\",\"C\",\"D\"}))","v":0},0,-9,"Split Genus",null,-9,4,1,28206,-9,6,2]
["Aleurites fordii",null,null,null,null,null,{"$f":"SUM(COUNTIFS(C40:F40,{\"P\",\"C\",\"D\"}))","v":0},0,0,"Category 2",null,"Exotic",2,1,28207,2,6,2]
["Alnus serrulata",null,null,null,null,null,{"$f":"SUM(COUNTIFS(C41:F41,{\"P\",\"C\",\"D\"}))","v":0},0,5.5,"Not Listed","OBL","Native",3,5,19468,1,6,2]
["Alocasia",null,null,null,null,null,{"$f":"SUM(COUNTIFS(C42:F42,{\"P\",\"C\",\"D\"}))","v":0},0,-9,"Not Listed",null,-9,3,1,42556,-9,1,1]
["Alternanthera",null,null,null,null,null,{"$f":"SUM(COUNTIFS(C43:F43,{\"P\",\"C\",\"D\"}))","v":0},0,null,-9,null,-9,-9,-9,20763,-9,-9,-9]
["Alternanthera philoxeroides",null,null,null,null,null,{"$f":"SUM(COUNTIFS(C44:F44,{\"P\",\"C\",\"D\"}))","v":0},0,0,"Category 2","OBL","Exotic",2,5,20770,2,1,1]
["Alternanthera sessilis","Alternanthera tenella",null,null,null,null,{"$f":"SUM(COUNTIFS(C45:F45,{\"P\",\"C\",\"D\"}))","v":0},0,0.11,"Not Listed","OBL","Exotic",3,5,20773,2,1,1]
["Amaranthus",null,null,null,null,null,{"$f":"SUM(COUNTIFS(C46:F46,{\"P\",\"C\",\"D\"}))","v":0},0,-9,"Not Listed",null,-9,3,-9,20715,-9,1,1]
["Amaranthus australis",null,null,null,null,null,{"$f":"SUM(COUNTIFS(C47:F47,{\"P\",\"C\",\"D\"}))","v":0},0,1,"Not Listed","OBL","Native",3,5,20721,1,1,1]
["Amaranthus blitum",null,null,null,null,null,{"$f":"SUM(COUNTIFS(C48:F48,{\"P\",\"C\",\"D\"}))","v":0},0,0,"Not Listed",null,"Exotic",3,-9,10007675,2,null,1]
["Amaranthus spinosus",null,null,null,null,null,{"$f":"SUM(COUNTIFS(C49:F49,{\"P\",\"C\",\"D\"}))","v":0},0,0.04,"Not Listed",null,"Exotic",3,1,20748,2,1,1]
["Amaroucium",null,null,null,null,null,{"$f":"SUM(COUNTIFS(C50:F50,{\"P\",\"C\",\"D\"}))","v":0},0,null,-9,null,-9,-9,-9,158939,-9,-9,-9]
["Ambrosia",null,null,null,null,null,{"$f":"SUM(COUNTIFS(C51:F51,{\"P\",\"C\",\"D\"}))","v":0},0,null,-9,null,-9,-9,-9,36495,-9,-9,-9]
["Ambrosia artemisiifolia",null,null,null,null,null,{"$f":"SUM(COUNTIFS(C52:F52,{\"P\",\"C\",\"D\"}))","v":0},0,0.95,"Not Listed",null,"Native",3,1,36496,1,1,1]
["Ammannia",null,null,null,null,null,{"$f":"SUM(COUNTIFS(C53:F53,{\"P\",\"C\",\"D\"}))","v":0},0,-9,"Not Listed","OBL","Native",3,5,27090,1,1,1]
["Ammannia coccinea",null,null,null,null,null,{"$f":"SUM(COUNTIFS(C54:F54,{\"P\",\"C\",\"D\"}))","v":0},0,5.0599999999999996,"Not Listed","OBL","Native",3,5,27091,1,1,1]
["Ammannia latifolia",null,null,null,null,null,{"$f":"SUM(COUNTIFS(C55:F55,{\"P\",\"C\",\"D\"}))","v":0},0,4.55,"Not Listed","OBL","Native",3,5,27092,1,1,1]
["Amorpha",null,null,null,null,null,{"$f":"SUM(COUNTIFS(C56:F56,{\"P\",\"C\",\"D\"}))","v":0},0,-9,"Not Listed","Var Genus",-9,3,9,25367,-9,5,3]
["Amorpha fruticosa",null,null,null,null,null,{"$f":"SUM(COUNTIFS(C57:F57,{\"P\",\"C\",\"D\"}))","v":0},0,4.3099999999999996,"Not Listed","FACW","Native",3,4,25368,1,4,2]
["Ampelopsis",null,null,null,null,null,{"$f":"SUM(COUNTIFS(C58:F58,{\"P\",\"C\",\"D\"}))","v":0},0,null,-9,null,-9,-9,-9,28630,-9,-9,-9]
["Ampelopsis arborea",null,null,null,null,null,{"$f":"SUM(COUNTIFS(C59:F59,{\"P\",\"C\",\"D\"}))","v":0},0,3.25,"Not Listed",null,"Native",3,1,28631,1,7,2]
["Amphicarpum muhlenbergianum","Amphicarpum floridanum",null,null,null,null,{"$f":"SUM(COUNTIFS(C60:F60,{\"P\",\"C\",\"D\"}))","v":0},0,5.7,"Not Listed","FACW","Native",3,4,41386,1,2,1]
["Andropogon",null,null,null,null,null,{"$f":"SUM(COUNTIFS(C61:F61,{\"P\",\"C\",\"D\"}))","v":0},0,-9,"Not Listed","Var Genus","Native",3,9,40450,1,2,1]
["Andropogon glomeratus",null,null,null,null,null,{"$f":"SUM(COUNTIFS(C62:F62,{\"P\",\"C\",\"D\"}))","v":0},0,3,"Not Listed","FACW","Native",3,4,40454,1,2,1]
["Andropogon gyrans",null,null,null,null,null,{"$f":"SUM(COUNTIFS(C63:F63,{\"P\",\"C\",\"D\"}))","v":0},0,6.07,"Not Listed","FAC","Native",3,3,10008711,1,2,1]
["Andropogon gyrans stenophyllus","Andropogon gyrans stenophyllus (Andropogon perangustatus)",null,null,null,null,{"$f":"SUM(COUNTIFS(C64:F64,{\"P\",\"C\",\"D\"}))","v":0},0,6.07,"Not Listed","FAC","Native",3,3,10008712,1,null,1]
["Andropogon mohrii","Andropogon liebmanii",null,null,null,null,{"$f":"SUM(COUNTIFS(C65:F65,{\"P\",\"C\",\"D\"}))","v":0},0,7,"Not Listed","FACW","Native",3,4,40464,1,2,1]
["Andropogon virginicus",null,null,null,null,null,{"$f":"SUM(COUNTIFS(C66:F66,{\"P\",\"C\",\"D\"}))","v":0},0,3,"Not Listed","FAC","Native",3,3,40456,1,2,1]
["Annona",null,null,null,null,null,{"$f":"SUM(COUNTIFS(C67:F67,{\"P\",\"C\",\"D\"}))","v":0},0,null,-9,null,-9,-9,-9,18095,-9,-9,-9]
["Annona glabra",null,null,null,null,null,{"$f":"SUM(COUNTIFS(C68:F68,{\"P\",\"C\",\"D\"}))","v":0},0,7,"Not Listed","OBL","Native",3,5,18101,1,6,2]
["Apios",null,null,null,null,null,{"$f":"SUM(COUNTIFS(C69:F69,{\"P\",\"C\",\"D\"}))","v":0},0,null,-9,null,-9,-9,-9,25389,-9,-9,-9]
["Apios americana",null,null,null,null,null,{"$f":"SUM(COUNTIFS(C70:F70,{\"P\",\"C\",\"D\"}))","v":0},0,3.85,"Not Listed",null,"Native",3,1,25390,1,1,1]
["Ardisia",null,null,null,null,null,{"$f":"SUM(COUNTIFS(C71:F71,{\"P\",\"C\",\"D\"}))","v":0},0,-9,"Split Genus","FAC",-9,4,3,23888,-9,4,2]
["Ardisia escallonioides",null,null,null,null,null,{"$f":"SUM(COUNTIFS(C72:F72,{\"P\",\"C\",\"D\"}))","v":0},0,4.17,"Not Listed","FAC","Native",3,3,23889,1,6,2]
["Aristida",null,null,null,null,null,{"$f":"SUM(COUNTIFS(C73:F73,{\"P\",\"C\",\"D\"}))","v":0},0,-9,"Not Listed","Var Genus","Native",3,9,41400,1,2,1]
["Aristida lanosa",null,null,null,null,null,{"$f":"SUM(COUNTIFS(C74:F74,{\"P\",\"C\",\"D\"}))","v":0},0,8.73,"Not Listed",null,"Native",3,-9,41404,1,null,1]
["Aristida palustris",null,null,null,null,null,{"$f":"SUM(COUNTIFS(C75:F75,{\"P\",\"C\",\"D\"}))","v":0},0,8.23,"Not Listed","OBL","Native",3,8,10007674,1,null,1]
["Aristida patula",null,null,null,null,null,{"$f":"SUM(COUNTIFS(C76:F76,{\"P\",\"C\",\"D\"}))","v":0},0,4.8499999999999996,"Not Listed",null,"Native",3,-9,41427,1,null,1]
["Aristida purpurascens",null,null,null,null,null,{"$f":"SUM(COUNTIFS(C77:F77,{\"P\",\"C\",\"D\"}))","v":0},0,5.58,"Not Listed","FACW","Native",3,4,41428,1,null,1]
["Aristida stricta",null,null,null,null,null,{"$f":"SUM(COUNTIFS(C78:F78,{\"P\",\"C\",\"D\"}))","v":0},0,8.67,"Not Listed","FAC","Native",3,3,41433,1,2,1]
["Arnoglossum",null,null,null,null,null,{"$f":"SUM(COUNTIFS(C79:F79,{\"P\",\"C\",\"D\"}))","v":0},0,-9,"Not Listed","Var Genus",-9,3,9,36582,-9,1,1]
["Arnoglossum sulcatum",null,null,null,null,null,{"$f":"SUM(COUNTIFS(C80:F80,{\"P\",\"C\",\"D\"}))","v":0},{"$f":"IF(OR(N80=3,N80=4,N80=5,N80=8,N80=9,Q80=7,O80=18036),G80,0)","v":0},7.13,"Not Listed","OBL","Native",3,5,36589,1,1,1]
["Aronia arbutifolia",null,null,null,null,null,{"$f":"SUM(COUNTIFS(C81:F81,{\"P\",\"C\",\"D\"}))","v":0},0,5.2,"Not Listed","FACW","Native",3,4,25126,1,-9,2]
["Arundinaria gigantea",null,null,null,null,null,{"$f":"SUM(COUNTIFS(C82:F82,{\"P\",\"C\",\"D\"}))","v":0},0,5.25,"Not Listed","FACW","Native",3,4,40477,1,2,1]
["Arundo",null,null,null,null,null,{"$f":"SUM(COUNTIFS(C83:F83,{\"P\",\"C\",\"D\"}))","v":0},0,-9,"Not Listed","FAC",-9,3,3,41449,-9,2,1]
["Arundo donax",null,null,null,null,null,{"$f":"SUM(COUNTIFS(C84:F84,{\"P\",\"C\",\"D\"}))","v":0},0,0,"Not Listed","FAC","Exotic",3,3,41450,2,2,1]
["Asclepias",null,null,null,null,null,{"$f":"SUM(COUNTIFS(C85:F85,{\"P\",\"C\",\"D\"}))","v":0},0,null,-9,null,-9,-9,-9,30240,-9,-9,-9]
["Asclepias incarnata",null,null,null,null,null,{"$f":"SUM(COUNTIFS(C86:F86,{\"P\",\"C\",\"D\"}))","v":0},0,-9,"Not Listed","OBL","Native",3,5,30241,1,1,1]
["Asclepias lanceolata",null,null,null,null,null,{"$f":"SUM(COUNTIFS(C87:F87,{\"P\",\"C\",\"D\"}))","v":0},0,6.73,"Not Listed","OBL","Native",3,5,30242,1,null,1]
["Asclepias perennis",null,null,null,null,null,{"$f":"SUM(COUNTIFS(C88:F88,{\"P\",\"C\",\"D\"}))","v":0},0,null,"Not Listed","OBL","Native",3,5,10015848,1,1,1]
["Aster",null,null,null,null,null,{"$f":"SUM(COUNTIFS(C89:F89,{\"P\",\"C\",\"D\"}))","v":0},0,-9,"Not Listed","Var Genus","Native",3,9,35510,1,1,3]
["Aster tortifolius",null,null,null,null,null,{"$f":"SUM(COUNTIFS(C90:F90,{\"P\",\"C\",\"D\"}))","v":0},0,4.62,"Not Listed",null,"Native",3,1,35667,1,1,1]
["Avicennia germinans",null,null,null,null,null,{"$f":"SUM(COUNTIFS(C91:F91,{\"P\",\"C\",\"D\"}))","v":0},0,4.5,"Not Listed","OBL","Native",3,5,32137,1,4,2]
["Axonopus",null,null,null,null,null,{"$f":"SUM(COUNTIFS(C92:F92,{\"P\",\"C\",\"D\"}))","v":0},0,-9,"Not Listed","FAC",-9,3,3,41463,-9,2,1]
["Axonopus affinis",null,null,null,null,null,{"$f":"SUM(COUNTIFS(C93:F93,{\"P\",\"C\",\"D\"}))","v":0},0,1.89,"Not Listed","FAC","Native",3,3,41464,1,2,1]
["Axonopus furcatus",null,null,null,null,null,{"$f":"SUM(COUNTIFS(C94:F94,{\"P\",\"C\",\"D\"}))","v":0},0,2.12,"Not Listed","FAC","Native",3,3,41466,1,2,1]
["Azolla",null,null,null,null,null,{"$f":"SUM(COUNTIFS(C95:F95,{\"P\",\"C\",\"D\"}))","v":0},0,null,"Not Listed","OBL",-9,3,8,18006,-9,1,1]
["Azolla caroliniana",null,null,null,null,null,{"$f":"SUM(COUNTIFS(C96:F96,{\"P\",\"C\",\"D\"}))","v":0},0,1.81,"Not Listed","OBL","Native",3,8,18008,1,null,1]
["Azolla filiculoides",null,null,null,null,null,{"$f":"SUM(COUNTIFS(C97:F97,{\"P\",\"C\",\"D\"}))","v":0},0,1.81,"Not Listed","OBL","Native",3,8,18007,1,1,1]
["Azolla pinnata",null,null,null,null,null,{"$f":"SUM(COUNTIFS(C98:F98,{\"P\",\"C\",\"D\"}))","v":0},0,0,"Not Listed","OBL","Exotic",3,8,10016083,2,1,1]
["Baccharis",null,null,null,null,null,{"$f":"SUM(COUNTIFS(C99:F99,{\"P\",\"C\",\"D\"}))","v":0},0,-9,"Not Listed","Var Genus","Native",3,9,35681,1,4,2]
["Baccharis angustifolia",null,null,null,null,null,{"$f":"SUM(COUNTIFS(C100:F100,{\"P\",\"C\",\"D\"}))","v":0},0,4.2,"Not Listed","OBL","Native",3,5,35683,1,4,-9]
["Baccharis glomeruliflora",null,null,null,null,null,{"$f":"SUM(COUNTIFS(C101:F101,{\"P\",\"C\",\"D\"}))","v":0},0,3,"Not Listed","FAC","Native",3,3,35689,1,4,2]
["Baccharis halimifolia",null,null,null,null,null,{"$f":"SUM(COUNTIFS(C102:F102,{\"P\",\"C\",\"D\"}))","v":0},0,2.5299999999999998,"Not Listed","FAC","Native",3,3,35682,1,4,2]
["Bacopa",null,null,null,null,null,{"$f":"SUM(COUNTIFS(C103:F103,{\"P\",\"C\",\"D\"}))","v":0},0,-9,"Not Listed","OBL","Native",3,5,33037,1,1,1]
["Bacopa caroliniana",null,null,null,null,null,{"$f":"SUM(COUNTIFS(C104:F104,{\"P\",\"C\",\"D\"}))","v":0},0,4.5,"Not Listed","OBL","Native",3,5,33039,1,1,1]
["Bacopa inominata",null,null,null,null,null,{"$f":"SUM(COUNTIFS(C105:F105,{\"P\",\"C\",\"D\"}))","v":0},0,7.48,"Not Listed","OBL","Native",3,5,10007676,1,null,1]
["Bacopa monnieri",null,null,null,null,null,{"$f":"SUM(COUNTIFS(C106:F106,{\"P\",\"C\",\"D\"}))","v":0},0,3.5,"Not Listed","OBL","Native",3,5,33038,1,1,1]
["Bambusa",null,null,null,null,null,{"$f":"SUM(COUNTIFS(C107:F107,{\"P\",\"C\",\"D\"}))","v":0},0,-9,"Not Listed",null,-9,3,1,10009233,-9,2,1]
["Begonia",null,null,null,null,null,{"$f":"SUM(COUNTIFS(C108:F108,{\"P\",\"C\",\"D\"}))","v":0},0,-9,"Split Genus",null,-9,4,1,22327,-9,1,1]
["Betula nigra",null,null,null,null,null,{"$f":"SUM(COUNTIFS(C109:F109,{\"P\",\"C\",\"D\"}))","v":0},0,null,"Not Listed","OBL","Native",3,5,19480,1,6,2]
["Bidens",null,null,null,null,null,{"$f":"SUM(COUNTIFS(C110:F110,{\"P\",\"C\",\"D\"}))","v":0},0,-9,"Not Listed","Var Genus","Native",3,9,35705,1,1,1]
["Bidens alba",null,null,null,null,null,{"$f":"SUM(COUNTIFS(C111:F111,{\"P\",\"C\",\"D\"}))","v":0},0,1,"Not Listed","FAC","Native",3,3,10008614,1,1,1]
["Bidens discoidea",null,null,null,null,null,{"$f":"SUM(COUNTIFS(C112:F112,{\"P\",\"C\",\"D\"}))","v":0},0,4.5,"Not Listed","OBL","Native",3,5,35719,1,1,1]
["Bidens laevis",null,null,null,null,null,{"$f":"SUM(COUNTIFS(C113:F113,{\"P\",\"C\",\"D\"}))","v":0},0,5.5,"Not Listed","OBL","Native",3,5,35711,1,1,1]
["Bidens mitis",null,null,null,null,null,{"$f":"SUM(COUNTIFS(C114:F114,{\"P\",\"C\",\"D\"}))","v":0},0,4.5,"Not Listed","OBL","Native",3,5,35729,1,1,1]
["Bidens pilosa",null,null,null,null,null,{"$f":"SUM(COUNTIFS(C115:F115,{\"P\",\"C\",\"D\"}))","v":0},0,1.64,"Not Listed","FAC","Exotic",3,3,35731,2,1,1]
["Bigelowia",null,null,null,null,null,{"$f":"SUM(COUNTIFS(C116:F116,{\"P\",\"C\",\"D\"}))","v":0},0,null,-9,null,-9,-9,-9,36836,-9,-9,-9]
["Bigelowia nudata",null,null,null,null,null,{"$f":"SUM(COUNTIFS(C117:F117,{\"P\",\"C\",\"D\"}))","v":0},0,7.59,"Not Listed","FACW","Native",3,4,36837,1,1,1]
["Blechnum",null,null,null,null,null,{"$f":"SUM(COUNTIFS(C118:F118,{\"P\",\"C\",\"D\"}))","v":0},0,-9,"Not Listed",null,"Native",3,1,17862,1,1,1]
["Blechnum serrulatum",null,null,null,null,null,{"$f":"SUM(COUNTIFS(C119:F119,{\"P\",\"C\",\"D\"}))","v":0},0,5.5,"Not Listed","FACW","Native",3,4,17864,1,1,1]
["Boehmeria",null,null,null,null,null,{"$f":"SUM(COUNTIFS(C120:F120,{\"P\",\"C\",\"D\"}))","v":0},0,null,-9,null,-9,-9,-9,19120,-9,-9,-9]
["Boehmeria cylindrica",null,"P","","P","P",{"$f":"SUM(COUNTIFS(C121:F121,{\"P\",\"C\",\"D\"}))","v":3},3,5,"Not Listed","OBL","Native",3,5,19121,1,1,1]
["Boltonia",null,null,null,null,null,{"$f":"SUM(COUNTIFS(C122:F122,{\"P\",\"C\",\"D\"}))","v":0},0,null,-9,null,-9,-9,-9,36852,-9,-9,-9]
["Boltonia apalachicolensis",null,null,null,null,null,{"$f":"SUM(COUNTIFS(C123:F123,{\"P\",\"C\",\"D\"}))","v":0},0,7.17,"Not Listed","FACW","Native",3,4,10015478,1,1,1]
["Boltonia diffusa",null,null,null,null,null,{"$f":"SUM(COUNTIFS(C124:F124,{\"P\",\"C\",\"D\"}))","v":0},0,4.96,"Not Listed","FACW","Native",3,4,36855,1,1,1]
["Brachiaria",null,null,null,null,null,{"$f":"SUM(COUNTIFS(C125:F125,{\"P\",\"C\",\"D\"}))","v":0},0,-9,"Split Genus","Var Genus",-9,4,9,41512,-9,2,1]
["Brasenia schreberi",null,null,null,null,null,{"$f":"SUM(COUNTIFS(C126:F126,{\"P\",\"C\",\"D\"}))","v":0},0,8.7899999999999991,"Not Listed","OBL","Native",3,5,18370,1,1,1]
["Burmannia capitata",null,null,null,null,null,{"$f":"SUM(COUNTIFS(C127:F127,{\"P\",\"C\",\"D\"}))","v":0},0,8.1300000000000008,"Not Listed","OBL","Native",3,5,43389,1,null,1]
["Cabomba caroliniana",null,null,null,null,null,{"$f":"SUM(COUNTIFS(C128:F128,{\"P\",\"C\",\"D\"}))","v":0},0,5.5,"Not Listed","OBL","Native",3,5,18408,1,1,1]
["Callicarpa americana",null,null,null,null,null,{"$f":"SUM(COUNTIFS(C129:F129,{\"P\",\"C\",\"D\"}))","v":0},0,3.2,"Not Listed","UPL","Native",3,2,32144,1,4,2]
["Callistemon viminalis",null,null,null,null,null,{"$f":"SUM(COUNTIFS(C130:F130,{\"P\",\"C\",\"D\"}))","v":0},0,0,"Category 2",null,"Exotic",2,1,10008851,2,4,2]
["Callitriche",null,null,null,null,null,{"$f":"SUM(COUNTIFS(C131:F131,{\"P\",\"C\",\"D\"}))","v":0},0,-9,"Not Listed","OBL",-9,3,5,32050,-9,1,1]
["Campsis radicans",null,null,null,null,null,{"$f":"SUM(COUNTIFS(C132:F132,{\"P\",\"C\",\"D\"}))","v":0},0,2.5299999999999998,"Not Listed",null,"Native",3,1,34309,1,7,2]
["Canna",null,null,null,null,null,{"$f":"SUM(COUNTIFS(C133:F133,{\"P\",\"C\",\"D\"}))","v":0},0,-9,"Not Listed","OBL","Native",3,5,42409,1,1,1]
["Canna flaccida",null,null,null,null,null,{"$f":"SUM(COUNTIFS(C134:F134,{\"P\",\"C\",\"D\"}))","v":0},0,5.5,"Not Listed","OBL","Native",3,5,42410,1,1,1]
["Canna indica",null,null,null,null,null,{"$f":"SUM(COUNTIFS(C135:F135,{\"P\",\"C\",\"D\"}))","v":0},0,null,"Not Listed","OBL","Exotic",3,5,42413,2,1,1]
["Canna x generalis",null,null,null,null,null,{"$f":"SUM(COUNTIFS(C136:F136,{\"P\",\"C\",\"D\"}))","v":0},0,-9,"Not Listed","FAC","Exotic",3,3,10015736,2,1,1]
["Caperonia",null,null,null,null,null,{"$f":"SUM(COUNTIFS(C137:F137,{\"P\",\"C\",\"D\"}))","v":0},0,-9,"Not Listed","FACW",-9,3,4,28242,-9,1,1]
["Caperonia castaneifolia",null,null,null,null,null,{"$f":"SUM(COUNTIFS(C138:F138,{\"P\",\"C\",\"D\"}))","v":0},0,4.9400000000000004,"Not Listed","FACW","Native",3,4,10007679,1,1,1]
["Caperonia palustris",null,null,null,null,null,{"$f":"SUM(COUNTIFS(C139:F139,{\"P\",\"C\",\"D\"}))","v":0},0,0.52,"Not Listed","FACW","Exotic",3,4,28243,2,null,1]
["Cardamine",null,null,null,null,null,{"$f":"SUM(COUNTIFS(C140:F140,{\"P\",\"C\",\"D\"}))","v":0},0,null,-9,null,-9,-9,-9,22768,-9,-9,-9]
["Cardamine pensylvanica",null,null,null,null,null,{"$f":"SUM(COUNTIFS(C141:F141,{\"P\",\"C\",\"D\"}))","v":0},0,4.42,"Not Listed","OBL","Native",3,5,22772,1,1,1]
["Carex",null,null,null,null,null,{"$f":"SUM(COUNTIFS(C142:F142,{\"P\",\"C\",\"D\"}))","v":0},0,-9,"Not Listed","Var Genus",-9,3,9,39369,-9,2,1]
["Carex alata",null,null,null,null,null,{"$f":"SUM(COUNTIFS(C143:F143,{\"P\",\"C\",\"D\"}))","v":0},0,4.2699999999999996,"Not Listed","FACW","Native",3,4,39370,1,null,1]
["Carex albolutescens","Carex longi",null,null,null,null,{"$f":"SUM(COUNTIFS(C144:F144,{\"P\",\"C\",\"D\"}))","v":0},{"$f":"IF(OR(N144=3,N144=4,N144=5,N144=8,N144=9,Q144=7,O144=18036),G144,0)","v":0},3.47,"Not Listed","FACW","Native",3,4,39371,1,2,1]
["Carex comosa",null,null,null,null,null,{"$f":"SUM(COUNTIFS(C145:F145,{\"P\",\"C\",\"D\"}))","v":0},0,1.5,"Not Listed","OBL","Native",3,5,39384,1,2,1]
["Carex decomposita",null,null,null,null,null,{"$f":"SUM(COUNTIFS(C146:F146,{\"P\",\"C\",\"D\"}))","v":0},0,-9,"Not Listed","OBL","Native",3,5,39389,1,2,1]
["Carex elliottii",null,null,null,null,null,{"$f":"SUM(COUNTIFS(C147:F147,{\"P\",\"C\",\"D\"}))","v":0},0,null,"Not Listed","OBL","Native",3,5,39588,1,2,1]
["Carex fissa",null,null,null,null,null,{"$f":"SUM(COUNTIFS(C148:F148,{\"P\",\"C\",\"D\"}))","v":0},0,3.9,"Not Listed","FACW","Native",3,4,39601,1,2,1]
["Carex gigantea",null,null,null,null,null,{"$f":"SUM(COUNTIFS(C149:F149,{\"P\",\"C\",\"D\"}))","v":0},0,5.07,"Not Listed","OBL","Native",3,5,39394,1,2,1]
["Carex glaucescens",null,null,null,null,null,{"$f":"SUM(COUNTIFS(C150:F150,{\"P\",\"C\",\"D\"}))","v":0},0,4.7,"Not Listed","FACW","Native",3,4,39396,1,2,1]
["Carex joorii",null,null,null,null,null,{"$f":"SUM(COUNTIFS(C151:F151,{\"P\",\"C\",\"D\"}))","v":0},0,0,"Not Listed","FACW","Native",3,4,10015972,1,2,1]
["Carex longii",null,null,null,null,null,{"$f":"SUM(COUNTIFS(C152:F152,{\"P\",\"C\",\"D\"}))","v":0},0,2.25,"Not Listed","FACW","Native",3,4,10010633,1,2,1]
["Carex lupuliformis",null,null,null,null,null,{"$f":"SUM(COUNTIFS(C153:F153,{\"P\",\"C\",\"D\"}))","v":0},0,5.5,"Not Listed","OBL","Native",3,5,39412,1,2,1]
["Carex lupulina",null,null,null,null,null,{"$f":"SUM(COUNTIFS(C154:F154,{\"P\",\"C\",\"D\"}))","v":0},0,5.5,"Not Listed","OBL","Native",3,5,39413,1,2,1]
["Carex lurida","Carex rostrata",null,null,null,null,{"$f":"SUM(COUNTIFS(C155:F155,{\"P\",\"C\",\"D\"}))","v":0},0,4.29,"Not Listed","OBL","Native",3,5,39414,1,2,1]
["Carex stipata",null,null,null,null,null,{"$f":"SUM(COUNTIFS(C156:F156,{\"P\",\"C\",\"D\"}))","v":0},0,4.46,"Not Listed","OBL","Native",3,5,39434,1,2,1]
["Carex striata","Carex striata (Carex walteriana)",null,null,null,null,{"$f":"SUM(COUNTIFS(C157:F157,{\"P\",\"C\",\"D\"}))","v":0},0,4,"Not Listed","OBL","Native",3,5,10010653,1,null,1]
["Carex verrucosa",null,null,null,null,null,{"$f":"SUM(COUNTIFS(C158:F158,{\"P\",\"C\",\"D\"}))","v":0},0,9.1,"Not Listed","FACW","Native",3,4,39862,1,2,1]
["Carphephorus",null,null,null,null,null,{"$f":"SUM(COUNTIFS(C159:F159,{\"P\",\"C\",\"D\"}))","v":0},0,-9,"Not Listed","Var Genus",-9,3,9,36939,-9,1,1]
["Carphephorus odoratissimus",null,null,null,null,null,{"$f":"SUM(COUNTIFS(C160:F160,{\"P\",\"C\",\"D\"}))","v":0},0,6.93,"Not Listed","FAC","Native",3,3,10007678,1,null,1]
["Carpinus caroliniana",null,null,null,null,null,{"$f":"SUM(COUNTIFS(C161:F161,{\"P\",\"C\",\"D\"}))","v":0},0,6.5,"Not Listed","FACW","Native",3,4,19504,1,6,2]
["Cartrema",null,null,null,null,null,{"$f":"SUM(COUNTIFS(C162:F162,{\"P\",\"C\",\"D\"}))","v":0},0,0,"Not Listed","Var Genus","Native",3,9,10016058,1,4,2]
["Cartrema americanus",null,null,null,null,null,{"$f":"SUM(COUNTIFS(C163:F163,{\"P\",\"C\",\"D\"}))","v":0},0,0,"Not Listed","FAC","Native",3,3,10016059,1,4,2]
["Carya",null,null,null,null,null,{"$f":"SUM(COUNTIFS(C164:F164,{\"P\",\"C\",\"D\"}))","v":0},0,-9,"Not Listed","Var Genus","Native",3,9,19223,1,6,2]
["Carya aquatica",null,null,null,null,null,{"$f":"SUM(COUNTIFS(C165:F165,{\"P\",\"C\",\"D\"}))","v":0},0,7,"Not Listed","OBL","Native",3,5,19224,1,6,2]
["Cassia",null,null,null,null,null,{"$f":"SUM(COUNTIFS(C166:F166,{\"P\",\"C\",\"D\"}))","v":0},0,1.46,"Not Listed",null,"Exotic",3,1,25735,2,1,1]
["Cassia fistula",null,null,null,null,null,{"$f":"SUM(COUNTIFS(C167:F167,{\"P\",\"C\",\"D\"}))","v":0},0,null,-9,null,-9,-9,-9,25749,-9]
["Cassytha",null,null,null,null,null,{"$f":"SUM(COUNTIFS(C168:F168,{\"P\",\"C\",\"D\"}))","v":0},0,null,-9,null,-9,-9,-9,18172,-9,-9,-9]
["Cassytha filiformis",null,null,null,null,null,{"$f":"SUM(COUNTIFS(C169:F169,{\"P\",\"C\",\"D\"}))","v":0},0,3.34,"Not Listed",null,"Native",3,1,18173,1,7,1]
["Casuarina",null,null,null,null,null,{"$f":"SUM(COUNTIFS(C170:F170,{\"P\",\"C\",\"D\"}))","v":0},0,0,"Split Genus","FAC","Exotic",4,3,19514,2,6,2]
["Casuarina equisetifolia",null,null,null,null,null,{"$f":"SUM(COUNTIFS(C171:F171,{\"P\",\"C\",\"D\"}))","v":0},0,0,"Category 1","FAC","Exotic",1,3,19516,2,6,2]
["Casuarina glauca",null,null,null,null,null,{"$f":"SUM(COUNTIFS(C172:F172,{\"P\",\"C\",\"D\"}))","v":0},0,0,"Category 1",null,"Exotic",1,-9,19517,2,null,-9]
["Catalpa bignonioides",null,null,null,null,null,{"$f":"SUM(COUNTIFS(C173:F173,{\"P\",\"C\",\"D\"}))","v":0},0,3.27,"Not Listed",null,"Native",3,1,34313,1,6,2]
["Celtis",null,null,null,null,null,{"$f":"SUM(COUNTIFS(C174:F174,{\"P\",\"C\",\"D\"}))","v":0},0,null,-9,null,-9,-9,-9,19039,-9,-9,-9]
["Celtis laevigata",null,null,null,null,null,{"$f":"SUM(COUNTIFS(C175:F175,{\"P\",\"C\",\"D\"}))","v":0},0,5.08,"Not Listed","FACW","Native",3,4,19042,1,6,2]
["Cenchrus",null,null,null,null,null,{"$f":"SUM(COUNTIFS(C176:F176,{\"P\",\"C\",\"D\"}))","v":0},0,null,-9,null,-9,-9,-9,40569,-9,-9,-9]
["Centella asiatica","Centella erecta",null,null,null,null,{"$f":"SUM(COUNTIFS(C177:F177,{\"P\",\"C\",\"D\"}))","v":0},0,1.92,"Not Listed","FACW","Native",3,4,29612,1,1,1]
["Cephalanthus occidentalis",null,"P","P","","P",{"$f":"SUM(COUNTIFS(C178:F178,{\"P\",\"C\",\"D\"}))","v":3},3,5,"Not Listed","OBL","Native",3,5,34786,1,4,2]
["Ceratophyllum",null,null,null,null,null,{"$f":"SUM(COUNTIFS(C179:F179,{\"P\",\"C\",\"D\"}))","v":0},0,null,"Not Listed","OBL","Native",3,5,18402,1,-9,-9]
["Ceratophyllum demersum",null,null,null,null,null,{"$f":"SUM(COUNTIFS(C180:F180,{\"P\",\"C\",\"D\"}))","v":0},0,4.16,"Not Listed","OBL","Native",3,5,18403,1,1,1]
["Ceratopteris",null,null,null,null,null,{"$f":"SUM(COUNTIFS(C181:F181,{\"P\",\"C\",\"D\"}))","v":0},0,-9,"Not Listed","OBL",-9,3,5,17955,-9,1,1]
["Ceratopteris pteridoides",null,null,null,null,null,{"$f":"SUM(COUNTIFS(C182:F182,{\"P\",\"C\",\"D\"}))","v":0},0,2.67,"Not Listed","OBL","Native",3,5,17956,1,1,1]
["Ceratopteris thalictroides",null,null,null,null,null,{"$f":"SUM(COUNTIFS(C183:F183,{\"P\",\"C\",\"D\"}))","v":0},0,2.93,"Not Listed","OBL","Exotic",3,5,17958,2,1,1]
["Cestrum diurnum",null,null,null,null,null,{"$f":"SUM(COUNTIFS(C184:F184,{\"P\",\"C\",\"D\"}))","v":0},0,0,"Category 2",null,"Exotic",2,3,30496,2,-9,-9]
["Chamaecyparis thyoides",null,null,null,null,null,{"$f":"SUM(COUNTIFS(C185:F185,{\"P\",\"C\",\"D\"}))","v":0},0,7.09,"Not Listed","OBL","Native",3,5,18046,1,6,2]
["Chara",null,null,null,null,null,{"$f":"SUM(COUNTIFS(C186:F186,{\"P\",\"C\",\"D\"}))","v":0},0,3.9,"Not Listed","OBL","Native",3,5,9421,1,3,1]
["Chasmanthium",null,null,null,null,null,{"$f":"SUM(COUNTIFS(C187:F187,{\"P\",\"C\",\"D\"}))","v":0},0,null,-9,null,-9,-9,-9,41546,-9,-9,-9]
["Chasmanthium laxum",null,null,null,null,null,{"$f":"SUM(COUNTIFS(C188:F188,{\"P\",\"C\",\"D\"}))","v":0},0,7.37,"Not Listed","FACW","Native",3,4,41548,1,2,1]
["Chasmanthium nitidum",null,null,null,null,null,{"$f":"SUM(COUNTIFS(C189:F189,{\"P\",\"C\",\"D\"}))","v":0},0,5.67,"Not Listed","FACW","Native",3,4,41549,1,2,1]
["Chenopodium",null,null,null,null,null,{"$f":"SUM(COUNTIFS(C190:F190,{\"P\",\"C\",\"D\"}))","v":0},0,-9,"Not Listed",null,-9,3,-9,20589,-9,1,1]
["Chenopodium album",null,null,null,null,null,{"$f":"SUM(COUNTIFS(C191:F191,{\"P\",\"C\",\"D\"}))","v":0},0,0.78,"Not Listed",null,"Exotic",3,-9,20592,2,null,1]
["Chenopodium ambrosioides",null,null,null,null,null,{"$f":"SUM(COUNTIFS(C192:F192,{\"P\",\"C\",\"D\"}))","v":0},0,0.59,"Not Listed",null,"Exotic",3,-9,20590,2,null,1]
["Chrysobalanus icaco",null,null,null,null,null,{"$f":"SUM(COUNTIFS(C193:F193,{\"P\",\"C\",\"D\"}))","v":0},0,5.63,"Not Listed","FACW","Native",3,4,25148,1,4,2]
["Chrysoma pauciflosculosa",null,null,null,null,null,{"$f":"SUM(COUNTIFS(C194:F194,{\"P\",\"C\",\"D\"}))","v":0},0,4.4000000000000004,"Not Listed",null,"Native",3,1,37047,1,4,2]
["Chrysopsis",null,null,null,null,null,{"$f":"SUM(COUNTIFS(C195:F195,{\"P\",\"C\",\"D\"}))","v":0},0,-9,"Not Listed",null,-9,3,1,10010558,-9,1,1]
["Chrysopsis lanuginosa",null,null,null,null,null,{"$f":"SUM(COUNTIFS(C196:F196,{\"P\",\"C\",\"D\"}))","v":0},0,null,"Not Listed",null,"Native",3,1,10015828,1,1,1]
["Chrysopsis mariana",null,null,null,null,null,{"$f":"SUM(COUNTIFS(C197:F197,{\"P\",\"C\",\"D\"}))","v":0},0,3.7,"Not Listed","UPL","Native",3,2,10010513,1,1,1]
["Cicuta maculata","Cicuta mexicana",null,null,null,null,{"$f":"SUM(COUNTIFS(C198:F198,{\"P\",\"C\",\"D\"}))","v":0},0,4.54,"Not Listed","OBL","Native",3,5,29456,1,1,1]
["Cinnamomum camphora",null,null,null,null,null,{"$f":"SUM(COUNTIFS(C199:F199,{\"P\",\"C\",\"D\"}))","v":0},0,0,"Category 1","UPL","Exotic",1,2,18175,2,6,2]
["Cirsium",null,null,null,null,null,{"$f":"SUM(COUNTIFS(C200:F200,{\"P\",\"C\",\"D\"}))","v":0},0,null,-9,null,-9,-9,-9,36334,-9,-9,-9]
["Cirsium nuttallii",null,null,null,null,null,{"$f":"SUM(COUNTIFS(C201:F201,{\"P\",\"C\",\"D\"}))","v":0},0,3.08,"Not Listed","FACW","Native",3,4,36390,1,1,1]
["Cladium",null,null,null,null,null,{"$f":"SUM(COUNTIFS(C202:F202,{\"P\",\"C\",\"D\"}))","v":0},0,null,-9,null,-9,-9,-9,39877,-9,-9,-9]
["Cladium jamaicense",null,null,null,null,null,{"$f":"SUM(COUNTIFS(C203:F203,{\"P\",\"C\",\"D\"}))","v":0},0,8,"Not Listed","OBL","Native",3,5,39878,1,2,1]
["Clethra alnifolia",null,null,null,null,null,{"$f":"SUM(COUNTIFS(C204:F204,{\"P\",\"C\",\"D\"}))","v":0},0,5.63,"Not Listed","FACW","Native",3,4,23454,1,4,2]
["Cliftonia monophylla",null,null,null,null,null,{"$f":"SUM(COUNTIFS(C205:F205,{\"P\",\"C\",\"D\"}))","v":0},0,5.63,"Not Listed","FACW","Native",3,4,23446,1,6,2]
["Clinopodium",null,null,null,null,null,{"$f":"SUM(COUNTIFS(C206:F206,{\"P\",\"C\",\"D\"}))","v":0},0,null,"Not Listed","Var Genus",-9,3,9,10015827,-9,1,1]
["Clinopodium brownei","Micromeria brownei",null,null,null,null,{"$f":"SUM(COUNTIFS(C207:F207,{\"P\",\"C\",\"D\"}))","v":0},0,6.34,"Not Listed","OBL","Native",3,5,10015824,1,1,1]
["Coccoloba",null,null,null,null,null,{"$f":"SUM(COUNTIFS(C208:F208,{\"P\",\"C\",\"D\"}))","v":0},{"$f":"IF(OR(N208=3,N208=4,N208=5,N208=8,N208=9,Q208=7,O208=18036),G208,0)","v":0},null,-9,null,-9,-9,-9,21037,-9,-9,-9]
["Coccoloba uvifera",null,null,null,null,null,{"$f":"SUM(COUNTIFS(C209:F209,{\"P\",\"C\",\"D\"}))","v":0},0,-9,"Not Listed",null,"Native",3,1,21039,1,4,2]
["Cocos nucifera",null,null,null,null,null,{"$f":"SUM(COUNTIFS(C210:F210,{\"P\",\"C\",\"D\"}))","v":0},0,0,"Category 2","OBL","Exotic",2,5,42451,2,6,2]
["Coelorachis",null,null,null,null,null,{"$f":"SUM(COUNTIFS(C211:F211,{\"P\",\"C\",\"D\"}))","v":0},0,-9,"Not Listed","Var Genus",-9,3,9,41580,-9,2,1]
["Coelorachis cylindrica",null,null,null,null,null,{"$f":"SUM(COUNTIFS(C212:F212,{\"P\",\"C\",\"D\"}))","v":0},0,7,"Not Listed","FAC","Native",3,3,41581,1,2,1]
["Coelorachis rugosa",null,null,null,null,null,{"$f":"SUM(COUNTIFS(C213:F213,{\"P\",\"C\",\"D\"}))","v":0},0,8.91,"Not Listed","FACW","Native",3,4,41582,1,2,1]
["Coelorachis tuberculosa",null,null,null,null,null,{"$f":"SUM(COUNTIFS(C214:F214,{\"P\",\"C\",\"D\"}))","v":0},0,9.0299999999999994,"Not Listed","FACW","Native",3,4,10007671,1,2,1]
["Colocasia esculenta",null,null,null,null,null,{"$f":"SUM(COUNTIFS(C215:F215,{\"P\",\"C\",\"D\"}))","v":0},0,0,"Category 1","OBL","Exotic",1,5,42549,2,1,1]
["Commelina",null,null,null,null,null,{"$f":"SUM(COUNTIFS(C216:F216,{\"P\",\"C\",\"D\"}))","v":0},0,2,"Not Listed","Var Genus",-9,3,9,39126,-9,1,1]
["Commelina diffusa",null,null,null,null,null,{"$f":"SUM(COUNTIFS(C217:F217,{\"P\",\"C\",\"D\"}))","v":0},0,2.02,"Not Listed","FACW","Exotic",3,4,39131,2,1,1]
["Commelina erecta",null,null,null,null,null,{"$f":"SUM(COUNTIFS(C218:F218,{\"P\",\"C\",\"D\"}))","v":0},0,2,"Not Listed","UPL","Native",3,2,39132,1,1,1]
["Commelina virginica",null,null,null,null,null,{"$f":"SUM(COUNTIFS(C219:F219,{\"P\",\"C\",\"D\"}))","v":0},0,4.67,"Not Listed","FACW","Native",3,4,39128,1,1,1]
["Conoclinium coelestinum",null,null,null,null,null,{"$f":"SUM(COUNTIFS(C220:F220,{\"P\",\"C\",\"D\"}))","v":0},0,4.37,"Not Listed","FAC","Native",3,3,10007672,1,1,1]
["Conyza",null,null,null,null,null,{"$f":"SUM(COUNTIFS(C221:F221,{\"P\",\"C\",\"D\"}))","v":0},0,-9,-9,null,-9,-9,-9,37108,-9,1,1]
["Conyza canadensis",null,null,null,null,null,{"$f":"SUM(COUNTIFS(C222:F222,{\"P\",\"C\",\"D\"}))","v":0},0,1.01,"Not Listed",null,"Native",3,1,37113,1,1,1]
["Coreopsis",null,null,null,null,null,{"$f":"SUM(COUNTIFS(C223:F223,{\"P\",\"C\",\"D\"}))","v":0},0,-9,"Not Listed","Var Genus",-9,3,9,37123,-9,1,1]
["Coreopsis gladiata",null,null,null,null,null,{"$f":"SUM(COUNTIFS(C224:F224,{\"P\",\"C\",\"D\"}))","v":0},0,4,"Not Listed","FACW","Native",3,4,37134,1,1,1]
["Coreopsis leavenworthii",null,null,null,null,null,{"$f":"SUM(COUNTIFS(C225:F225,{\"P\",\"C\",\"D\"}))","v":0},0,3.43,"Not Listed","FACW","Native",3,4,37141,1,1,1]
["Coreopsis nudata",null,null,null,null,null,{"$f":"SUM(COUNTIFS(C226:F226,{\"P\",\"C\",\"D\"}))","v":0},0,-9,"Not Listed","OBL","Native",3,5,37145,1,1,1]
["Coreopsis tinctoria",null,null,null,null,null,{"$f":"SUM(COUNTIFS(C227:F227,{\"P\",\"C\",\"D\"}))","v":0},0,0.9,"Not Listed",null,"Native",3,1,10011071,1,1,1]
["Cornus",null,null,null,null,null,{"$f":"SUM(COUNTIFS(C228:F228,{\"P\",\"C\",\"D\"}))","v":0},0,-9,"Not Listed","Var Genus","Native",3,9,27798,1,6,2]
["Cornus foemina",null,null,null,null,null,{"$f":"SUM(COUNTIFS(C229:F229,{\"P\",\"C\",\"D\"}))","v":0},0,5.91,"Not Listed","FAC","Native",3,3,27802,1,6,2]
["Cortaderia selloana",null,null,null,null,null,{"$f":"SUM(COUNTIFS(C230:F230,{\"P\",\"C\",\"D\"}))","v":0},0,0,"Not Listed",null,"Exotic",3,1,41597,2,2,1]
["Crinum",null,null,null,null,null,{"$f":"SUM(COUNTIFS(C231:F231,{\"P\",\"C\",\"D\"}))","v":0},0,-9,"Not Listed","OBL","Native",3,5,10007711,1,1,1]
["Crinum americanum",null,null,null,null,null,{"$f":"SUM(COUNTIFS(C232:F232,{\"P\",\"C\",\"D\"}))","v":0},0,9,"Not Listed","OBL","Native",3,5,10007712,1,1,1]
["Crotalaria",null,null,null,null,null,{"$f":"SUM(COUNTIFS(C233:F233,{\"P\",\"C\",\"D\"}))","v":0},0,-9,"Not Listed",null,-9,3,1,26569,-9,8,3]
["Crotalaria pallida",null,null,null,null,null,{"$f":"SUM(COUNTIFS(C234:F234,{\"P\",\"C\",\"D\"}))","v":0},0,0,"Not Listed",null,"Exotic",3,1,26574,2,5,3]
["Crotalaria spectabilis",null,null,null,null,null,{"$f":"SUM(COUNTIFS(C235:F235,{\"P\",\"C\",\"D\"}))","v":0},0,0,"Not Listed",null,"Exotic",3,1,26580,2,1,1]
["Ctenitis",null,null,null,null,null,{"$f":"SUM(COUNTIFS(C236:F236,{\"P\",\"C\",\"D\"}))","v":0},0,null,"Not Listed","Var Genus","Native",3,9,17464,1,1,1]
["Ctenitis submarginalis",null,null,null,null,null,{"$f":"SUM(COUNTIFS(C237:F237,{\"P\",\"C\",\"D\"}))","v":0},0,null,"Not Listed","FACW","Native",3,4,17466,1,1,1]
["Cucurbita",null,null,null,null,null,{"$f":"SUM(COUNTIFS(C238:F238,{\"P\",\"C\",\"D\"}))","v":0},0,null,-9,null,-9,-9,-9,22365,-9,-9,-9]
["Cucurbita okeechobeensis",null,null,null,null,null,{"$f":"SUM(COUNTIFS(C239:F239,{\"P\",\"C\",\"D\"}))","v":0},0,-9,"Not Listed",null,"Native",3,1,22371,1,7,1]
["Cupaniopsis anacardioides",null,null,null,null,null,{"$f":"SUM(COUNTIFS(C240:F240,{\"P\",\"C\",\"D\"}))","v":0},0,0,"Category 1","FAC","Exotic",1,3,10015571,2,6,2]
["Cuphea",null,null,null,null,null,{"$f":"SUM(COUNTIFS(C241:F241,{\"P\",\"C\",\"D\"}))","v":0},0,null,-9,null,-9,-9,-9,27094,-9,-9,-9]
["Cuphea carthagenensis",null,null,null,null,null,{"$f":"SUM(COUNTIFS(C242:F242,{\"P\",\"C\",\"D\"}))","v":0},0,1.92,"Not Listed","FAC","Exotic",3,3,27103,2,1,1]
["Cynodon",null,null,null,null,null,{"$f":"SUM(COUNTIFS(C243:F243,{\"P\",\"C\",\"D\"}))","v":0},0,null,-9,null,-9,-9,-9,41616,-9,-9,-9]
["Cynodon dactylon",null,null,null,null,null,{"$f":"SUM(COUNTIFS(C244:F244,{\"P\",\"C\",\"D\"}))","v":0},0,0.28999999999999998,"Not Listed",null,"Exotic",3,1,41619,2,2,1]
["Cyperus",null,null,null,null,null,{"$f":"SUM(COUNTIFS(C245:F245,{\"P\",\"C\",\"D\"}))","v":0},0,-9,"Split Genus","Var Genus",-9,4,9,39882,-9,2,1]
["Cyperus alopecuroides",null,null,null,null,null,{"$f":"SUM(COUNTIFS(C246:F246,{\"P\",\"C\",\"D\"}))","v":0},0,0,"Not Listed","FACW","Exotic",3,4,10015351,2,2,1]
["Cyperus alternifolius",null,null,null,null,null,{"$f":"SUM(COUNTIFS(C247:F247,{\"P\",\"C\",\"D\"}))","v":0},0,0,"Category 2","OBL","Exotic",2,5,39904,2,2,1]
["Cyperus articulatus",null,null,null,null,null,{"$f":"SUM(COUNTIFS(C248:F248,{\"P\",\"C\",\"D\"}))","v":0},0,6.64,"Not Listed","OBL","Native",3,5,39908,1,2,1]
["Cyperus blepharoleptos","Oxycaryum cubense",null,null,null,null,{"$f":"SUM(COUNTIFS(C249:F249,{\"P\",\"C\",\"D\"}))","v":0},0,0,"Not Listed","OBL","Exotic",3,5,10016052,2,2,1]
["Cyperus brevifolius",null,null,null,null,null,{"$f":"SUM(COUNTIFS(C250:F250,{\"P\",\"C\",\"D\"}))","v":0},0,1.42,"Not Listed","FACW","Native",3,4,39910,1,2,1]
["Cyperus compressus",null,null,null,null,null,{"$f":"SUM(COUNTIFS(C251:F251,{\"P\",\"C\",\"D\"}))","v":0},0,2.74,"Not Listed","FACW","Native",3,4,39913,1,2,1]
["Cyperus croceus","Cyperus globulosus",null,null,null,null,{"$f":"SUM(COUNTIFS(C252:F252,{\"P\",\"C\",\"D\"}))","v":0},0,1.3,"Not Listed","FAC","Native",3,3,10007727,1,2,1]
["Cyperus difformis",null,null,null,null,null,{"$f":"SUM(COUNTIFS(C253:F253,{\"P\",\"C\",\"D\"}))","v":0},0,0,"Not Listed","OBL","Exotic",3,5,39915,2,2,1]
["Cyperus distinctus",null,null,null,null,null,{"$f":"SUM(COUNTIFS(C254:F254,{\"P\",\"C\",\"D\"}))","v":0},0,5,"Not Listed","OBL","Native",3,5,39918,1,2,1]
["Cyperus drummondii",null,null,null,null,null,{"$f":"SUM(COUNTIFS(C255:F255,{\"P\",\"C\",\"D\"}))","v":0},0,4.67,"Not Listed","OBL","Native",3,5,10015401,1,2,1]
["Cyperus entrerianus",null,null,null,null,null,{"$f":"SUM(COUNTIFS(C256:F256,{\"P\",\"C\",\"D\"}))","v":0},0,1.5,"Not Listed","OBL","Exotic",3,5,10013731,2,2,1]
["Cyperus erythrorhizos",null,null,null,null,null,{"$f":"SUM(COUNTIFS(C257:F257,{\"P\",\"C\",\"D\"}))","v":0},0,2.89,"Not Listed","OBL","Native",3,5,39887,1,2,1]
["Cyperus esculentus",null,null,null,null,null,{"$f":"SUM(COUNTIFS(C258:F258,{\"P\",\"C\",\"D\"}))","v":0},0,0,"Not Listed","FAC","Exotic",3,3,39888,2,2,1]
["Cyperus flavescens",null,null,null,null,null,{"$f":"SUM(COUNTIFS(C259:F259,{\"P\",\"C\",\"D\"}))","v":0},0,2.17,"Not Listed","OBL","Native",3,5,39891,1,2,1]
["Cyperus flavicomus","Cyperus albomarginatus",null,null,null,null,{"$f":"SUM(COUNTIFS(C260:F260,{\"P\",\"C\",\"D\"}))","v":0},0,1.17,"Not Listed","FACW","Native",3,4,10015461,1,null,1]
["Cyperus haspan",null,null,null,null,null,{"$f":"SUM(COUNTIFS(C261:F261,{\"P\",\"C\",\"D\"}))","v":0},0,4,"Not Listed","OBL","Native",3,5,39930,1,2,1]
["Cyperus involucratus",null,null,null,null,null,{"$f":"SUM(COUNTIFS(C262:F262,{\"P\",\"C\",\"D\"}))","v":0},0,0,"Category 2","FACW","Exotic",2,4,10013491,2,2,1]
["Cyperus iria",null,null,null,null,null,{"$f":"SUM(COUNTIFS(C263:F263,{\"P\",\"C\",\"D\"}))","v":0},0,1.69,"Not Listed","FACW","Exotic",3,4,39934,2,2,1]
["Cyperus lanceolatus",null,null,null,null,null,{"$f":"SUM(COUNTIFS(C264:F264,{\"P\",\"C\",\"D\"}))","v":0},0,2.04,"Not Listed","OBL","Exotic",3,5,39936,2,2,1]
["Cyperus lecontei",null,null,null,null,null,{"$f":"SUM(COUNTIFS(C265:F265,{\"P\",\"C\",\"D\"}))","v":0},0,2.33,"Not Listed","FACW","Native",3,4,39937,1,2,1]
["Cyperus ligularis",null,null,null,null,null,{"$f":"SUM(COUNTIFS(C266:F266,{\"P\",\"C\",\"D\"}))","v":0},0,1.55,"Not Listed","FACW","Native",3,4,39938,1,2,1]
["Cyperus odoratus",null,"P","","","",{"$f":"SUM(COUNTIFS(C267:F267,{\"P\",\"C\",\"D\"}))","v":1},1,3,"Not Listed","FACW","Native",3,4,39894,1,2,1]
["Cyperus ovatus",null,null,null,null,null,{"$f":"SUM(COUNTIFS(C268:F268,{\"P\",\"C\",\"D\"}))","v":0},0,null,"Not Listed","FAC","Native",3,3,10015823,1,2,1]
["Cyperus papyrus",null,null,null,null,null,{"$f":"SUM(COUNTIFS(C269:F269,{\"P\",\"C\",\"D\"}))","v":0},0,0.31,"Not Listed","OBL","Exotic",3,5,39950,2,2,1]
["Cyperus polystachyos",null,null,null,null,null,{"$f":"SUM(COUNTIFS(C270:F270,{\"P\",\"C\",\"D\"}))","v":0},0,1.56,"Not Listed","FACW","Native",3,4,39957,1,2,1]
["Cyperus prolifer",null,null,null,null,null,{"$f":"SUM(COUNTIFS(C271:F271,{\"P\",\"C\",\"D\"}))","v":0},0,0,"Category 2","FACW","Exotic",2,4,10007729,2,2,1]
["Cyperus retrorsus",null,null,null,null,null,{"$f":"SUM(COUNTIFS(C272:F272,{\"P\",\"C\",\"D\"}))","v":0},{"$f":"IF(OR(N272=3,N272=4,N272=5,N272=8,N272=9,Q272=7,O272=18036),G272,0)","v":0},1.79,"Not Listed","FAC","Native",3,3,39898,1,2,1]
["Cyperus rotundus",null,null,null,null,null,{"$f":"SUM(COUNTIFS(C273:F273,{\"P\",\"C\",\"D\"}))","v":0},0,0,"Not Listed","FAC","Exotic",3,3,39900,2,2,1]
["Cyperus sphacelatus",null,null,null,null,null,{"$f":"SUM(COUNTIFS(C274:F274,{\"P\",\"C\",\"D\"}))","v":0},0,0.43,"Not Listed","FACW","Exotic",3,4,40000,2,2,1]
["Cyperus strigosus",null,null,null,null,null,{"$f":"SUM(COUNTIFS(C275:F275,{\"P\",\"C\",\"D\"}))","v":0},0,4.49,"Not Listed","FACW","Native",3,4,39901,1,2,1]
["Cyperus surinamensis",null,null,null,null,null,{"$f":"SUM(COUNTIFS(C276:F276,{\"P\",\"C\",\"D\"}))","v":0},0,2.0299999999999998,"Not Listed","FACW","Native",3,4,39970,1,2,1]
["Cyperus tetragonus",null,null,null,null,null,{"$f":"SUM(COUNTIFS(C277:F277,{\"P\",\"C\",\"D\"}))","v":0},0,null,"Not Listed","FAC","Native",3,3,39972,1,2,1]
["Cyperus virens",null,null,null,null,null,{"$f":"SUM(COUNTIFS(C278:F278,{\"P\",\"C\",\"D\"}))","v":0},0,5.7,"Not Listed","FACW","Native",3,4,39975,1,2,1]
["Cyrilla racemiflora",null,null,null,null,null,{"$f":"SUM(COUNTIFS(C279:F279,{\"P\",\"C\",\"D\"}))","v":0},0,5,"Not Listed","FAC","Native",3,3,23449,1,6,2]
["Dactyloctenium aegyptium",null,null,null,null,null,{"$f":"SUM(COUNTIFS(C280:F280,{\"P\",\"C\",\"D\"}))","v":0},0,0.67,"Not Listed",null,"Exotic",3,1,41630,2,2,1]
["Dalbergia",null,null,null,null,null,{"$f":"SUM(COUNTIFS(C281:F281,{\"P\",\"C\",\"D\"}))","v":0},0,null,-9,null,-9,-9,-9,26593,-9,-9,-9]
["Dalbergia ecastaphyllum",null,null,null,null,null,{"$f":"SUM(COUNTIFS(C282:F282,{\"P\",\"C\",\"D\"}))","v":0},0,null,"Not Listed","FAC","Native",3,3,26595,1,7,2]
["Decodon verticillatus",null,null,null,null,null,{"$f":"SUM(COUNTIFS(C283:F283,{\"P\",\"C\",\"D\"}))","v":0},0,6,"Not Listed","OBL","Native",3,5,27076,1,4,2]
["Desmodium",null,null,null,null,null,{"$f":"SUM(COUNTIFS(C284:F284,{\"P\",\"C\",\"D\"}))","v":0},0,null,-9,null,-9,-9,-9,25784,-9,-9,-9]
["Desmodium incanum",null,null,null,null,null,{"$f":"SUM(COUNTIFS(C285:F285,{\"P\",\"C\",\"D\"}))","v":0},0,-9,"Not Listed",null,"Native",3,1,25804,1,5,3]
["Desmodium triflorum",null,null,null,null,null,{"$f":"SUM(COUNTIFS(C286:F286,{\"P\",\"C\",\"D\"}))","v":0},0,0.43,"Not Listed",null,"Exotic",3,-9,25831,2,null,1]
["Dichanthelium",null,null,null,null,null,{"$f":"SUM(COUNTIFS(C287:F287,{\"P\",\"C\",\"D\"}))","v":0},0,-9,"Not Listed","Var Genus",-9,3,9,41645,-9,2,1]
["Dichanthelium commutatum",null,null,null,null,null,{"$f":"SUM(COUNTIFS(C288:F288,{\"P\",\"C\",\"D\"}))","v":0},0,6,"Not Listed","FAC","Native",3,3,41647,1,2,1]
["Dichanthelium dichotomom","Panicum dichotomum",null,null,null,null,{"$f":"SUM(COUNTIFS(C289:F289,{\"P\",\"C\",\"D\"}))","v":0},0,5.61,"Not Listed","FACW","Native",3,4,10016054,1,2,1]
["Dichanthelium ensifolium","Panicum ensifolium, Panicum chamaelonche",null,null,null,null,{"$f":"SUM(COUNTIFS(C290:F290,{\"P\",\"C\",\"D\"}))","v":0},0,6.5,"Not Listed","OBL","Native",3,5,10015717,1,2,1]
["Dichanthelium erectifolium","Panicum erectifolium",null,null,null,null,{"$f":"SUM(COUNTIFS(C291:F291,{\"P\",\"C\",\"D\"}))","v":0},0,6,"Not Listed","OBL","Native",3,5,41660,1,2,1]
["Dichanthelium laxiflorum",null,null,null,null,null,{"$f":"SUM(COUNTIFS(C292:F292,{\"P\",\"C\",\"D\"}))","v":0},0,6.79,"Not Listed","FAC","Native",3,3,41661,1,null,1]
["Dichanthelium leucothrix",null,null,null,null,null,{"$f":"SUM(COUNTIFS(C293:F293,{\"P\",\"C\",\"D\"}))","v":0},0,0,"Not Listed",null,"Native",3,1,10016055,1,2,1]
["Dichanthelium nudicaule",null,null,null,null,null,{"$f":"SUM(COUNTIFS(C294:F294,{\"P\",\"C\",\"D\"}))","v":0},0,0,"Not Listed",null,"Native",3,1,10016056,1,2,1]
["Dichanthelium scabriusculum","Panicum scabriusculum",null,null,null,null,{"$f":"SUM(COUNTIFS(C295:F295,{\"P\",\"C\",\"D\"}))","v":0},0,5.5,"Not Listed","OBL","Native",3,5,41670,1,2,1]
["Dichanthelium scoparium",null,null,null,null,null,{"$f":"SUM(COUNTIFS(C296:F296,{\"P\",\"C\",\"D\"}))","v":0},0,-9,"Not Listed","FACW","Native",3,4,10015744,1,2,1]
["Dichanthelium strigosum",null,null,null,null,null,{"$f":"SUM(COUNTIFS(C297:F297,{\"P\",\"C\",\"D\"}))","v":0},0,0,"Not Listed","FAC","Native",3,3,10016057,1,2,1]
["Dichondra",null,null,null,null,null,{"$f":"SUM(COUNTIFS(C298:F298,{\"P\",\"C\",\"D\"}))","v":0},0,null,-9,null,-9,-9,-9,30833,-9,-9,-9]
["Dichondra carolinensis","Dichondra repens",null,null,null,null,{"$f":"SUM(COUNTIFS(C299:F299,{\"P\",\"C\",\"D\"}))","v":0},0,1.75,"Not Listed","FAC","Native",3,3,30834,1,1,1]
["Dichromena colorata",null,null,null,null,null,{"$f":"SUM(COUNTIFS(C300:F300,{\"P\",\"C\",\"D\"}))","v":0},0,6.18,"Not Listed","FACW","Native",3,4,40004,1,2,1]
["Dichromena latifolia",null,null,null,null,null,{"$f":"SUM(COUNTIFS(C301:F301,{\"P\",\"C\",\"D\"}))","v":0},0,6.62,"Not Listed","OBL","Native",3,5,40006,1,null,1]
["Dicliptera",null,null,null,null,null,{"$f":"SUM(COUNTIFS(C302:F302,{\"P\",\"C\",\"D\"}))","v":0},0,null,-9,null,-9,-9,-9,34415,-9,-9,-9]
["Dicliptera sexangularis",null,null,null,null,null,{"$f":"SUM(COUNTIFS(C303:F303,{\"P\",\"C\",\"D\"}))","v":0},0,null,"Not Listed","FAC","Native",3,3,10015905,1,1,1]
["Digitaria",null,null,null,null,null,{"$f":"SUM(COUNTIFS(C304:F304,{\"P\",\"C\",\"D\"}))","v":0},0,null,-9,null,-9,-9,-9,40603,-9,-9,-9]
["Digitaria bicornis",null,null,null,null,null,{"$f":"SUM(COUNTIFS(C305:F305,{\"P\",\"C\",\"D\"}))","v":0},0,0,"Not Listed",null,"Exotic",3,1,40616,2,2,1]
["Digitaria ciliaris",null,null,null,null,null,{"$f":"SUM(COUNTIFS(C306:F306,{\"P\",\"C\",\"D\"}))","v":0},0,1.3,"Not Listed",null,"Native",3,1,40619,1,2,1]
["Digitaria serotina",null,null,null,null,null,{"$f":"SUM(COUNTIFS(C307:F307,{\"P\",\"C\",\"D\"}))","v":0},0,1.39,"Not Listed","FAC","Native",3,3,40612,1,2,1]
["Diodia virginiana",null,null,null,null,null,{"$f":"SUM(COUNTIFS(C308:F308,{\"P\",\"C\",\"D\"}))","v":0},0,3,"Not Listed","FACW","Native",3,4,34790,1,1,1]
["Dioscorea",null,null,null,null,null,{"$f":"SUM(COUNTIFS(C309:F309,{\"P\",\"C\",\"D\"}))","v":0},0,null,"Split Genus",null,-9,4,1,43366,-9,7,1]
["Dioscorea bulbifera",null,null,null,null,null,{"$f":"SUM(COUNTIFS(C310:F310,{\"P\",\"C\",\"D\"}))","v":0},0,0,"Category 1",null,"Exotic",1,1,43369,2,7,3]
["Diospyros",null,null,null,null,null,{"$f":"SUM(COUNTIFS(C311:F311,{\"P\",\"C\",\"D\"}))","v":0},0,null,-9,null,-9,-9,-9,23853,-9,-9,-9]
["Diospyros virginiana",null,null,null,null,null,{"$f":"SUM(COUNTIFS(C312:F312,{\"P\",\"C\",\"D\"}))","v":0},0,3,"Not Listed","FAC","Native",3,3,23855,1,6,2]
["Drosera",null,null,null,null,null,{"$f":"SUM(COUNTIFS(C313:F313,{\"P\",\"C\",\"D\"}))","v":0},0,-9,"Not Listed","Var Genus","Native",3,9,22009,1,1,1]
["Drosera brevifolia",null,null,null,null,null,{"$f":"SUM(COUNTIFS(C314:F314,{\"P\",\"C\",\"D\"}))","v":0},0,8.2100000000000009,"Not Listed","FACW","Native",3,4,22010,1,null,1]
["Drosera capillaris",null,null,null,null,null,{"$f":"SUM(COUNTIFS(C315:F315,{\"P\",\"C\",\"D\"}))","v":0},0,3,"Not Listed","FACW","Native",3,4,22011,1,1,1]
["Drosera filiformis",null,null,null,null,null,{"$f":"SUM(COUNTIFS(C316:F316,{\"P\",\"C\",\"D\"}))","v":0},0,7,"Not Listed","OBL","Native",3,5,22012,1,1,1]
["Drosera intermedia",null,null,null,null,null,{"$f":"SUM(COUNTIFS(C317:F317,{\"P\",\"C\",\"D\"}))","v":0},0,8.23,"Not Listed","OBL","Native",3,5,22013,1,1,1]
["Drymaria cordata",null,null,null,null,null,{"$f":"SUM(COUNTIFS(C318:F318,{\"P\",\"C\",\"D\"}))","v":0},0,2.72,"Not Listed","FAC","Native",3,3,20282,1,1,1]
["Dryopteris",null,null,null,null,null,{"$f":"SUM(COUNTIFS(C319:F319,{\"P\",\"C\",\"D\"}))","v":0},0,-9,"Not Listed","FACW",-9,3,4,17519,-9,1,1]
["Dryopteris ludoviciana",null,null,null,null,null,{"$f":"SUM(COUNTIFS(C320:F320,{\"P\",\"C\",\"D\"}))","v":0},0,7,"Not Listed","FACW","Native",3,4,17540,1,1,1]
["Dryopteris thelypteris",null,null,null,null,null,{"$f":"SUM(COUNTIFS(C321:F321,{\"P\",\"C\",\"D\"}))","v":0},0,null,-9,null,-9,-9,-9,17252,-9,-9,-9]
["Dulichium arundinaceum",null,null,null,null,null,{"$f":"SUM(COUNTIFS(C322:F322,{\"P\",\"C\",\"D\"}))","v":0},0,7.31,"Not Listed","OBL","Native",3,5,40009,1,2,1]
["Echinochloa",null,null,null,null,null,{"$f":"SUM(COUNTIFS(C323:F323,{\"P\",\"C\",\"D\"}))","v":0},0,-9,"Not Listed","FACW",-9,3,4,40667,-9,2,1]
["Echinochloa colona",null,null,null,null,null,{"$f":"SUM(COUNTIFS(C324:F324,{\"P\",\"C\",\"D\"}))","v":0},0,0.24,"Not Listed","FACW","Exotic",3,4,40670,2,2,1]
["Echinochloa crusgalli",null,null,null,null,null,{"$f":"SUM(COUNTIFS(C325:F325,{\"P\",\"C\",\"D\"}))","v":0},0,0.22,"Not Listed","FACW","Exotic",3,4,40668,2,2,1]
["Echinochloa muricata",null,null,null,null,null,{"$f":"SUM(COUNTIFS(C326:F326,{\"P\",\"C\",\"D\"}))","v":0},0,6.01,"Not Listed","FACW","Native",3,4,40672,1,2,1]
["Echinochloa walteri",null,null,null,null,null,{"$f":"SUM(COUNTIFS(C327:F327,{\"P\",\"C\",\"D\"}))","v":0},0,2.5,"Not Listed","FACW","Native",3,4,40669,1,2,1]
["Echinodorus",null,null,null,null,null,{"$f":"SUM(COUNTIFS(C328:F328,{\"P\",\"C\",\"D\"}))","v":0},0,-9,"Not Listed","OBL",-9,3,5,38898,-9,1,1]
["Echinodorus cordifolius",null,null,null,null,null,{"$f":"SUM(COUNTIFS(C329:F329,{\"P\",\"C\",\"D\"}))","v":0},0,-9,"Not Listed","OBL","Native",3,5,38900,1,1,1]
["Eclipta prostrata","Eclipta alba",null,null,null,null,{"$f":"SUM(COUNTIFS(C330:F330,{\"P\",\"C\",\"D\"}))","v":0},0,2,"Not Listed","FACW","Native",3,4,10007735,1,1,1]
["Egeria densa",null,null,null,null,null,{"$f":"SUM(COUNTIFS(C331:F331,{\"P\",\"C\",\"D\"}))","v":0},0,0.49,"Not Listed","OBL","Exotic",3,5,38972,2,1,1]
["Eichhornia",null,null,null,null,null,{"$f":"SUM(COUNTIFS(C332:F332,{\"P\",\"C\",\"D\"}))","v":0},0,null,-9,"OBL","Exotic",-9,5,10015797,2,1,1]
["Eichhornia crassipes",null,"D","D","D","D",{"$f":"SUM(COUNTIFS(C333:F333,{\"P\",\"C\",\"D\"}))","v":4},4,0,"Category 1","OBL","Exotic",1,5,42623,2,1,1]
["Eleocharis",null,null,null,null,null,{"$f":"SUM(COUNTIFS(C334:F334,{\"P\",\"C\",\"D\"}))","v":0},0,-9,"Not Listed","OBL","Native",3,5,40010,1,2,1]
["Eleocharis acicularis",null,null,null,null,null,{"$f":"SUM(COUNTIFS(C335:F335,{\"P\",\"C\",\"D\"}))","v":0},0,3.4,"Not Listed","OBL","Native",3,5,40025,1,2,1]
["Eleocharis atropurpurea",null,null,null,null,null,{"$f":"SUM(COUNTIFS(C336:F336,{\"P\",\"C\",\"D\"}))","v":0},{"$f":"IF(OR(N336=3,N336=4,N336=5,N336=8,N336=9,Q336=7,O336=18036),G336,0)","v":0},5.69,"Not Listed","OBL","Native",3,5,40027,1,2,1]
["Eleocharis baldwinii",null,null,null,null,null,{"$f":"SUM(COUNTIFS(C337:F337,{\"P\",\"C\",\"D\"}))","v":0},0,2.82,"Not Listed","OBL","Native",3,5,40029,1,2,1]
["Eleocharis cellulosa",null,null,null,null,null,{"$f":"SUM(COUNTIFS(C338:F338,{\"P\",\"C\",\"D\"}))","v":0},0,7.8,"Not Listed","OBL","Native",3,5,40036,1,2,1]
["Eleocharis elongata",null,null,null,null,null,{"$f":"SUM(COUNTIFS(C339:F339,{\"P\",\"C\",\"D\"}))","v":0},0,6.97,"Not Listed","OBL","Native",3,5,40041,1,2,1]
["Eleocharis equisetoides",null,null,null,null,null,{"$f":"SUM(COUNTIFS(C340:F340,{\"P\",\"C\",\"D\"}))","v":0},0,8,"Not Listed","OBL","Native",3,5,40042,1,2,1]
["Eleocharis flavescens",null,null,null,null,null,{"$f":"SUM(COUNTIFS(C341:F341,{\"P\",\"C\",\"D\"}))","v":0},0,2.1,"Not Listed","OBL","Native",3,5,40045,1,2,1]
["Eleocharis geniculata",null,null,null,null,null,{"$f":"SUM(COUNTIFS(C342:F342,{\"P\",\"C\",\"D\"}))","v":0},0,2.5,"Not Listed","OBL","Native",3,5,40046,1,2,1]
["Eleocharis interstincta",null,null,null,null,null,{"$f":"SUM(COUNTIFS(C343:F343,{\"P\",\"C\",\"D\"}))","v":0},0,7.8,"Not Listed","OBL","Native",3,5,40048,1,2,1]
["Eleocharis melanocarpa",null,null,null,null,null,{"$f":"SUM(COUNTIFS(C344:F344,{\"P\",\"C\",\"D\"}))","v":0},0,1.83,"Not Listed","OBL","Native",3,5,40053,1,2,1]
["Eleocharis microcarpa",null,null,null,null,null,{"$f":"SUM(COUNTIFS(C345:F345,{\"P\",\"C\",\"D\"}))","v":0},0,5.78,"Not Listed","OBL","Native",3,5,40054,1,null,1]
["Eleocharis montana",null,null,null,null,null,{"$f":"SUM(COUNTIFS(C346:F346,{\"P\",\"C\",\"D\"}))","v":0},0,3.17,"Not Listed","OBL","Native",3,5,40056,1,2,1]
["Eleocharis montevidensis",null,null,null,null,null,{"$f":"SUM(COUNTIFS(C347:F347,{\"P\",\"C\",\"D\"}))","v":0},0,5.2,"Not Listed","OBL","Native",3,5,40057,1,null,1]
["Eleocharis obtusa",null,null,null,null,null,{"$f":"SUM(COUNTIFS(C348:F348,{\"P\",\"C\",\"D\"}))","v":0},0,3.36,"Not Listed","OBL","Native",3,5,40017,1,2,1]
["Eleocharis olivacea",null,null,null,null,null,{"$f":"SUM(COUNTIFS(C349:F349,{\"P\",\"C\",\"D\"}))","v":0},0,1.4,"Not Listed","OBL","Native",3,5,40018,1,2,1]
["Eleocharis quadrangulata",null,null,null,null,null,{"$f":"SUM(COUNTIFS(C350:F350,{\"P\",\"C\",\"D\"}))","v":0},0,2.5,"Not Listed","OBL","Native",3,5,40021,1,2,1]
["Eleocharis robbinsii",null,null,null,null,null,{"$f":"SUM(COUNTIFS(C351:F351,{\"P\",\"C\",\"D\"}))","v":0},0,8,"Not Listed","OBL","Native",3,5,40068,1,2,1]
["Eleocharis submersed viviparous (species unknown)","(species unknown)",null,null,null,null,{"$f":"SUM(COUNTIFS(C352:F352,{\"P\",\"C\",\"D\"}))","v":0},0,3,"Not Listed","OBL","Native",3,5,10015743,1,null,1]
["Eleocharis tuberculosa",null,null,null,null,null,{"$f":"SUM(COUNTIFS(C353:F353,{\"P\",\"C\",\"D\"}))","v":0},0,-9,"Not Listed","OBL","Native",3,5,40024,1,2,1]
["Eleocharis vivipara",null,null,null,null,null,{"$f":"SUM(COUNTIFS(C354:F354,{\"P\",\"C\",\"D\"}))","v":0},0,3,"Not Listed","OBL","Native",3,5,40073,1,2,1]
["Elephantopus elatus",null,null,null,null,null,{"$f":"SUM(COUNTIFS(C355:F355,{\"P\",\"C\",\"D\"}))","v":0},0,2.72,"Not Listed",null,"Native",3,-9,37298,1,null,1]
["Eleusine indica",null,null,null,null,null,{"$f":"SUM(COUNTIFS(C356:F356,{\"P\",\"C\",\"D\"}))","v":0},0,0,"Not Listed",null,"Exotic",3,1,41692,2,2,1]
["Elodea canadensis",null,null,null,null,null,{"$f":"SUM(COUNTIFS(C357:F357,{\"P\",\"C\",\"D\"}))","v":0},0,null,"Not Listed","OBL","Native",3,5,38937,1,1,1]
["Emilia",null,null,null,null,null,{"$f":"SUM(COUNTIFS(C358:F358,{\"P\",\"C\",\"D\"}))","v":0},0,null,-9,null,-9,-9,-9,37302,-9,-9,-9]
["Emilia fosbergii",null,null,null,null,null,{"$f":"SUM(COUNTIFS(C359:F359,{\"P\",\"C\",\"D\"}))","v":0},0,-9,"Not Listed","UPL","Exotic",3,2,37304,2,1,1]
["Equisetum hyemale","Equisetum hyemale var. affine",null,null,null,null,{"$f":"SUM(COUNTIFS(C360:F360,{\"P\",\"C\",\"D\"}))","v":0},0,null,"Not Listed","FAC","Native",3,3,17154,1,1,1]
["Equisetum hyemale affine","Equisetum hyemale",null,null,null,null,{"$f":"SUM(COUNTIFS(C361:F361,{\"P\",\"C\",\"D\"}))","v":0},0,null,"Not Listed","FAC","Native",3,3,100106089,1,1,1]
["Eragrostis",null,null,null,null,null,{"$f":"SUM(COUNTIFS(C362:F362,{\"P\",\"C\",\"D\"}))","v":0},0,-9,"Not Listed","FAC",-9,3,3,40716,-9,2,1]
["Eragrostis atrovirens",null,null,null,null,null,{"$f":"SUM(COUNTIFS(C363:F363,{\"P\",\"C\",\"D\"}))","v":0},0,1.58,"Not Listed","FAC","Exotic",3,3,40718,2,null,1]
["Eragrostis elliottii",null,null,null,null,null,{"$f":"SUM(COUNTIFS(C364:F364,{\"P\",\"C\",\"D\"}))","v":0},0,4.1399999999999997,"Not Listed","FAC","Native",3,3,40720,1,2,1]
["Eragrostis gangetica",null,null,null,null,null,{"$f":"SUM(COUNTIFS(C365:F365,{\"P\",\"C\",\"D\"}))","v":0},0,null,"Not Listed","FAC","Exotic",3,3,40742,2,2,1]
["Eragrostis spectabilis",null,null,null,null,null,{"$f":"SUM(COUNTIFS(C366:F366,{\"P\",\"C\",\"D\"}))","v":0},0,3.44,"Not Listed","FAC","Native",3,3,40717,1,2,1]
["Eragrostis virginica",null,null,null,null,null,{"$f":"SUM(COUNTIFS(C367:F367,{\"P\",\"C\",\"D\"}))","v":0},0,null,"Not Listed","FAC","Native",3,3,10015837,1,2,1]
["Erechtites hieraciifolius","Erechtites hieraciifolia",null,null,null,null,{"$f":"SUM(COUNTIFS(C368:F368,{\"P\",\"C\",\"D\"}))","v":0},0,1,"Not Listed","FAC","Native",3,3,10008019,1,1,1]
["Erigeron",null,null,null,null,null,{"$f":"SUM(COUNTIFS(C369:F369,{\"P\",\"C\",\"D\"}))","v":0},0,null,"Split Genus",null,-9,4,-9,35803,-9,1,1]
["Erigeron quercifolius",null,null,null,null,null,{"$f":"SUM(COUNTIFS(C370:F370,{\"P\",\"C\",\"D\"}))","v":0},0,3.31,"Not Listed","FAC","Native",3,3,35940,1,1,1]
["Erigeron vernus",null,null,null,null,null,{"$f":"SUM(COUNTIFS(C371:F371,{\"P\",\"C\",\"D\"}))","v":0},0,null,"Not Listed","FACW","Native",3,4,35969,1,null,1]
["Eriocaulon",null,null,null,null,null,{"$f":"SUM(COUNTIFS(C372:F372,{\"P\",\"C\",\"D\"}))","v":0},0,-9,"Not Listed","OBL","Native",3,5,39194,1,1,1]
["Eriocaulon compressum",null,null,null,null,null,{"$f":"SUM(COUNTIFS(C373:F373,{\"P\",\"C\",\"D\"}))","v":0},0,7.5,"Not Listed","OBL","Native",3,5,39198,1,1,1]
["Eriocaulon decangulare",null,null,null,null,null,{"$f":"SUM(COUNTIFS(C374:F374,{\"P\",\"C\",\"D\"}))","v":0},0,8.31,"Not Listed","OBL","Native",3,5,39195,1,1,1]
["Eriocaulon lineare",null,null,null,null,null,{"$f":"SUM(COUNTIFS(C375:F375,{\"P\",\"C\",\"D\"}))","v":0},0,6,"Not Listed","OBL","Native",3,5,39200,1,1,1]
["Eriocaulon ravenelii",null,null,null,null,null,{"$f":"SUM(COUNTIFS(C376:F376,{\"P\",\"C\",\"D\"}))","v":0},0,5.9,"Not Listed","OBL","Native",3,5,39201,1,1,1]
["Eriocaulon texense",null,null,null,null,null,{"$f":"SUM(COUNTIFS(C377:F377,{\"P\",\"C\",\"D\"}))","v":0},0,8,"Not Listed","OBL","Native",3,5,39203,1,1,1]
["Eriochloa",null,null,null,null,null,{"$f":"SUM(COUNTIFS(C378:F378,{\"P\",\"C\",\"D\"}))","v":0},0,-9,"Not Listed","FACW",-9,3,4,41718,-9,2,1]
["Eriochloa michauxii",null,null,null,null,null,{"$f":"SUM(COUNTIFS(C379:F379,{\"P\",\"C\",\"D\"}))","v":0},0,-9,"Not Listed","FACW","Native",3,4,41726,1,2,1]
["Eryngium",null,null,null,null,null,{"$f":"SUM(COUNTIFS(C380:F380,{\"P\",\"C\",\"D\"}))","v":0},0,-9,"Not Listed","FACW","Native",3,4,29479,1,1,1]
["Eryngium prostratum",null,null,null,null,null,{"$f":"SUM(COUNTIFS(C381:F381,{\"P\",\"C\",\"D\"}))","v":0},0,-9,"Not Listed","FACW","Native",3,4,29502,1,1,1]
["Eupatorium",null,null,null,null,null,{"$f":"SUM(COUNTIFS(C382:F382,{\"P\",\"C\",\"D\"}))","v":0},0,-9,"Not Listed","Var Genus","Native",3,9,35977,1,1,1]
["Eupatorium capillifolium",null,"P","","","",{"$f":"SUM(COUNTIFS(C383:F383,{\"P\",\"C\",\"D\"}))","v":1},1,0.83,"Not Listed","FAC","Native",3,3,35978,1,1,1]
["Eupatorium compositifolium",null,null,null,null,null,{"$f":"SUM(COUNTIFS(C384:F384,{\"P\",\"C\",\"D\"}))","v":0},0,2.72,"Not Listed","FAC","Native",3,3,35985,1,1,1]
["Eupatorium fistulosum",null,null,null,null,null,{"$f":"SUM(COUNTIFS(C385:F385,{\"P\",\"C\",\"D\"}))","v":0},0,5,"Not Listed","FACW","Native",3,4,10013311,1,1,1]
["Eupatorium leptophyllum",null,null,null,null,null,{"$f":"SUM(COUNTIFS(C386:F386,{\"P\",\"C\",\"D\"}))","v":0},0,3.5,"Not Listed","OBL","Native",3,5,35991,1,1,1]
["Eupatorium mikanioides",null,null,null,null,null,{"$f":"SUM(COUNTIFS(C387:F387,{\"P\",\"C\",\"D\"}))","v":0},0,5.08,"Not Listed","FACW","Native",3,4,35994,1,1,1]
["Eupatorium mohrii","Eupatorium recurvans",null,null,null,null,{"$f":"SUM(COUNTIFS(C388:F388,{\"P\",\"C\",\"D\"}))","v":0},0,6.87,"Not Listed","FAC","Native",3,3,10007741,1,1,1]
["Eupatorium perfoliatum",null,null,null,null,null,{"$f":"SUM(COUNTIFS(C389:F389,{\"P\",\"C\",\"D\"}))","v":0},0,5.85,"Not Listed","FACW","Native",3,4,35980,1,1,1]
["Eupatorium serotinum",null,null,null,null,null,{"$f":"SUM(COUNTIFS(C390:F390,{\"P\",\"C\",\"D\"}))","v":0},0,3.43,"Not Listed","FAC","Native",3,3,35981,1,1,1]
["Euphorbia",null,null,null,null,null,{"$f":"SUM(COUNTIFS(C391:F391,{\"P\",\"C\",\"D\"}))","v":0},0,-9,"Not Listed","Var Genus",-9,3,9,28032,-9,1,1]
["Euphorbia cyathophora","Poinsettia cyathophora",null,null,null,null,{"$f":"SUM(COUNTIFS(C392:F392,{\"P\",\"C\",\"D\"}))","v":0},0,1.57,"Not Listed",null,"Native",3,-9,28060,1,null,1]
["Eustachys",null,null,null,null,null,{"$f":"SUM(COUNTIFS(C393:F393,{\"P\",\"C\",\"D\"}))","v":0},0,-9,"Not Listed","Var Genus",-9,3,9,41739,-9,2,1]
["Eustachys petraea",null,null,null,null,null,{"$f":"SUM(COUNTIFS(C394:F394,{\"P\",\"C\",\"D\"}))","v":0},0,1.93,"Not Listed","FAC","Native",3,3,10009171,1,2,1]
["Euthamia",null,null,null,null,null,{"$f":"SUM(COUNTIFS(C395:F395,{\"P\",\"C\",\"D\"}))","v":0},0,-9,"Not Listed","FAC","Native",3,3,37349,1,1,1]
["Euthamia caroliniana","Euthamia minor, Euthamia tenuifolia tenuifolia",null,null,null,null,{"$f":"SUM(COUNTIFS(C396:F396,{\"P\",\"C\",\"D\"}))","v":0},0,2.4500000000000002,"Not Listed","FAC","Native",3,3,10008693,1,1,1]
["Euthamia tenuifolia",null,null,null,null,null,{"$f":"SUM(COUNTIFS(C397:F397,{\"P\",\"C\",\"D\"}))","v":0},0,2.4500000000000002,"Not Listed","FACW","Native",3,4,10008694,1,1,1]
["Fatsia japonica",null,null,null,null,null,{"$f":"SUM(COUNTIFS(C398:F398,{\"P\",\"C\",\"D\"}))","v":0},0,0,"Not Listed",null,"Exotic",3,1,10011031,2,4,2]
["Ficus",null,null,null,null,null,{"$f":"SUM(COUNTIFS(C399:F399,{\"P\",\"C\",\"D\"}))","v":0},0,null,-9,null,-9,-9,-9,19081,-9,-9,-9]
["Ficus aurea",null,null,null,null,null,{"$f":"SUM(COUNTIFS(C400:F400,{\"P\",\"C\",\"D\"}))","v":0},{"$f":"IF(OR(N400=3,N400=4,N400=5,N400=8,N400=9,Q400=7,O400=18036),G400,0)","v":0},3.38,"Not Listed","FAC","Native",3,3,19092,1,7,2]
["Ficus microcarpa",null,null,null,null,null,{"$f":"SUM(COUNTIFS(C401:F401,{\"P\",\"C\",\"D\"}))","v":0},0,0,"Category 1",null,"Exotic",1,1,10010511,2,4,2]
["Fimbristylis",null,null,null,null,null,{"$f":"SUM(COUNTIFS(C402:F402,{\"P\",\"C\",\"D\"}))","v":0},0,-9,"Not Listed","Var Genus",-9,3,9,40107,-9,2,1]
["Fimbristylis autumnalis",null,null,null,null,null,{"$f":"SUM(COUNTIFS(C403:F403,{\"P\",\"C\",\"D\"}))","v":0},0,2.17,"Not Listed","OBL","Native",3,5,40111,1,2,1]
["Fimbristylis caroliniana",null,null,null,null,null,{"$f":"SUM(COUNTIFS(C404:F404,{\"P\",\"C\",\"D\"}))","v":0},0,5,"Not Listed","OBL","Native",3,5,40112,1,2,1]
["Fimbristylis castanea",null,null,null,null,null,{"$f":"SUM(COUNTIFS(C405:F405,{\"P\",\"C\",\"D\"}))","v":0},0,4.92,"Not Listed","OBL","Native",3,5,40109,1,2,1]
["Fimbristylis cymosa","Fimbristylis spathacea",null,null,null,null,{"$f":"SUM(COUNTIFS(C406:F406,{\"P\",\"C\",\"D\"}))","v":0},0,1,"Not Listed","FAC","Native",3,3,40123,1,2,1]
["Fimbristylis dichotoma",null,null,null,null,null,{"$f":"SUM(COUNTIFS(C407:F407,{\"P\",\"C\",\"D\"}))","v":0},0,3.55,"Not Listed","OBL","Native",3,5,40114,1,2,1]
["Fimbristylis miliacea",null,null,null,null,null,{"$f":"SUM(COUNTIFS(C408:F408,{\"P\",\"C\",\"D\"}))","v":0},0,1.95,"Not Listed","OBL","Exotic",3,5,40115,2,null,1]
["Fimbristylis schoenoides",null,null,null,null,null,{"$f":"SUM(COUNTIFS(C409:F409,{\"P\",\"C\",\"D\"}))","v":0},0,1.83,"Not Listed","OBL","Exotic",3,5,40118,2,2,1]
["Flaveria",null,null,null,null,null,{"$f":"SUM(COUNTIFS(C410:F410,{\"P\",\"C\",\"D\"}))","v":0},0,null,-9,null,-9,-9,-9,37375,-9,-9,-9]
["Flaveria floridana",null,null,null,null,null,{"$f":"SUM(COUNTIFS(C411:F411,{\"P\",\"C\",\"D\"}))","v":0},0,null,-9,null,-9,-9,-9,37380,-9,-9,-9]
["Fontinalis",null,null,null,null,null,{"$f":"SUM(COUNTIFS(C412:F412,{\"P\",\"C\",\"D\"}))","v":0},0,-9,"Not Listed",null,"Native",3,8,16417,1,1,1]
["Fraxinus",null,null,null,null,null,{"$f":"SUM(COUNTIFS(C413:F413,{\"P\",\"C\",\"D\"}))","v":0},0,-9,"Not Listed","Var Genus","Native",3,9,32928,1,6,2]
["Fraxinus americana",null,null,null,null,null,{"$f":"SUM(COUNTIFS(C414:F414,{\"P\",\"C\",\"D\"}))","v":0},0,5.27,"Not Listed","UPL","Native",3,2,32931,1,6,2]
["Fraxinus caroliniana",null,null,null,null,null,{"$f":"SUM(COUNTIFS(C415:F415,{\"P\",\"C\",\"D\"}))","v":0},0,5.21,"Not Listed","OBL","Native",3,5,32941,1,6,2]
["Fraxinus profunda",null,null,null,null,null,{"$f":"SUM(COUNTIFS(C416:F416,{\"P\",\"C\",\"D\"}))","v":0},0,6,"Not Listed","OBL","Native",3,5,32934,1,-9,2]
["Froelichia floridana",null,null,null,null,null,{"$f":"SUM(COUNTIFS(C417:F417,{\"P\",\"C\",\"D\"}))","v":0},0,3.21,"Not Listed",null,"Native",3,1,20799,1,1,1]
["Fuirena",null,null,null,null,null,{"$f":"SUM(COUNTIFS(C418:F418,{\"P\",\"C\",\"D\"}))","v":0},0,-9,"Not Listed","OBL","Native",3,5,40130,1,2,1]
["Fuirena breviseta",null,null,null,null,null,{"$f":"SUM(COUNTIFS(C419:F419,{\"P\",\"C\",\"D\"}))","v":0},0,3.5,"Not Listed","OBL","Native",3,5,40133,1,2,1]
["Fuirena pumila",null,null,null,null,null,{"$f":"SUM(COUNTIFS(C420:F420,{\"P\",\"C\",\"D\"}))","v":0},0,4,"Not Listed","OBL","Native",3,5,40131,1,2,1]
["Fuirena scirpoidea",null,null,null,null,null,{"$f":"SUM(COUNTIFS(C421:F421,{\"P\",\"C\",\"D\"}))","v":0},0,5.5,"Not Listed","OBL","Native",3,5,40136,1,2,1]
["Fuirena squarrosa",null,null,null,null,null,{"$f":"SUM(COUNTIFS(C422:F422,{\"P\",\"C\",\"D\"}))","v":0},0,5.5,"Not Listed","OBL","Native",3,5,40132,1,2,1]
["Galactia elliottii",null,null,null,null,null,{"$f":"SUM(COUNTIFS(C423:F423,{\"P\",\"C\",\"D\"}))","v":0},0,null,"Not Listed","UPL","Native",3,2,10012411,1,-9,1]
["Galium",null,null,null,null,null,{"$f":"SUM(COUNTIFS(C424:F424,{\"P\",\"C\",\"D\"}))","v":0},0,-9,"Not Listed",null,"Native",3,1,34796,1,1,1]
["Galium pilosum",null,null,null,null,null,{"$f":"SUM(COUNTIFS(C425:F425,{\"P\",\"C\",\"D\"}))","v":0},0,4.7699999999999996,"Not Listed",null,"Native",3,-9,34907,1,null,1]
["Galium tinctorium",null,null,null,null,null,{"$f":"SUM(COUNTIFS(C426:F426,{\"P\",\"C\",\"D\"}))","v":0},0,5.08,"Not Listed","FACW","Native",3,4,34803,1,1,1]
["Galium uniflorum",null,null,null,null,null,{"$f":"SUM(COUNTIFS(C427:F427,{\"P\",\"C\",\"D\"}))","v":0},0,5.8,"Not Listed",null,"Native",3,1,34935,1,1,1]
["Gaylussacia dumosa",null,null,null,null,null,{"$f":"SUM(COUNTIFS(C428:F428,{\"P\",\"C\",\"D\"}))","v":0},0,5.44,"Not Listed","FAC","Native",3,3,23662,1,-9,2]
["Gaylussacia frondosa",null,null,null,null,null,{"$f":"SUM(COUNTIFS(C429:F429,{\"P\",\"C\",\"D\"}))","v":0},0,null,-9,null,-9,-9,-9,23663,-9]
["Gelsemium sempervirens",null,null,null,null,null,{"$f":"SUM(COUNTIFS(C430:F430,{\"P\",\"C\",\"D\"}))","v":0},0,3.9,"Not Listed",null,"Native",3,-9,29932,1,-9,2]
["Gleditsia",null,null,null,null,null,{"$f":"SUM(COUNTIFS(C431:F431,{\"P\",\"C\",\"D\"}))","v":0},0,null,-9,null,-9,-9,-9,26711,-9,-9,-9]
["Gleditsia aquatica",null,null,null,null,null,{"$f":"SUM(COUNTIFS(C432:F432,{\"P\",\"C\",\"D\"}))","v":0},0,7.09,"Not Listed","OBL","Native",3,5,26712,1,6,2]
["Gleditsia triacanthos",null,null,null,null,null,{"$f":"SUM(COUNTIFS(C433:F433,{\"P\",\"C\",\"D\"}))","v":0},0,3.83,"Not Listed","FACW","Native",3,4,26714,1,6,2]
["Gnaphalium",null,null,null,null,null,{"$f":"SUM(COUNTIFS(C434:F434,{\"P\",\"C\",\"D\"}))","v":0},0,-9,"Not Listed",null,-9,3,1,36693,-9,1,1]
["Gomphrena serrata",null,null,null,null,null,{"$f":"SUM(COUNTIFS(C435:F435,{\"P\",\"C\",\"D\"}))","v":0},0,0.87,"Not Listed",null,"Exotic",3,-9,20808,2,null,1]
["Gordonia lasianthus",null,null,null,null,null,{"$f":"SUM(COUNTIFS(C436:F436,{\"P\",\"C\",\"D\"}))","v":0},0,7,"Not Listed","FACW","Native",3,4,21386,1,6,2]
["Gratiola",null,null,null,null,null,{"$f":"SUM(COUNTIFS(C437:F437,{\"P\",\"C\",\"D\"}))","v":0},0,null,-9,null,-9,-9,-9,33189,-9,-9,-9]
["Gratiola floridana",null,null,null,null,null,{"$f":"SUM(COUNTIFS(C438:F438,{\"P\",\"C\",\"D\"}))","v":0},0,null,"Not Listed","FACW","Native",3,4,33195,1,1,1]
["Gratiola pilosa",null,null,null,null,null,{"$f":"SUM(COUNTIFS(C439:F439,{\"P\",\"C\",\"D\"}))","v":0},0,6.63,"Not Listed","FACW","Native",3,4,33198,1,null,1]
["Gratiola ramosa",null,null,null,null,null,{"$f":"SUM(COUNTIFS(C440:F440,{\"P\",\"C\",\"D\"}))","v":0},0,6.87,"Not Listed","FACW","Native",3,4,33199,1,1,1]
["Habenaria",null,null,null,null,null,{"$f":"SUM(COUNTIFS(C441:F441,{\"P\",\"C\",\"D\"}))","v":0},0,null,-9,null,-9,-9,-9,43398,-9,-9,-9]
["Habenaria repens",null,null,null,null,null,{"$f":"SUM(COUNTIFS(C442:F442,{\"P\",\"C\",\"D\"}))","v":0},0,3.5,"Not Listed","FACW","Native",3,4,43402,1,1,1]
["Hedychium coronarium",null,null,null,null,null,{"$f":"SUM(COUNTIFS(C443:F443,{\"P\",\"C\",\"D\"}))","v":0},0,-9,"Not Listed",null,"Exotic",3,7,42396,2,1,1]
["Hedyotis",null,null,null,null,null,{"$f":"SUM(COUNTIFS(C444:F444,{\"P\",\"C\",\"D\"}))","v":0},0,-9,"Not Listed",null,-9,3,1,35007,-9,1,1]
["Hedyotis corymbosa","Oldenlandia corymbosa",null,null,null,null,{"$f":"SUM(COUNTIFS(C445:F445,{\"P\",\"C\",\"D\"}))","v":0},0,2.31,"Not Listed","FACW","Exotic",3,4,10007751,2,1,1]
["Helenium",null,null,null,null,null,{"$f":"SUM(COUNTIFS(C446:F446,{\"P\",\"C\",\"D\"}))","v":0},0,null,-9,null,-9,-9,-9,36005,-9,-9,-9]
["Helenium autumnale",null,null,null,null,null,{"$f":"SUM(COUNTIFS(C447:F447,{\"P\",\"C\",\"D\"}))","v":0},0,3.31,"Not Listed","FACW","Native",3,4,36006,1,1,1]
["Helianthus",null,null,null,null,null,{"$f":"SUM(COUNTIFS(C448:F448,{\"P\",\"C\",\"D\"}))","v":0},0,-9,"Not Listed",null,-9,3,1,36611,-9,1,1]
["Helianthus angustifolius",null,null,null,null,null,{"$f":"SUM(COUNTIFS(C449:F449,{\"P\",\"C\",\"D\"}))","v":0},0,3,"Not Listed","FACW","Native",3,4,36615,1,1,1]
["Helianthus floridanus",null,null,null,null,null,{"$f":"SUM(COUNTIFS(C450:F450,{\"P\",\"C\",\"D\"}))","v":0},0,5.85,"Not Listed","FAC","Native",3,3,36640,1,null,1]
["Heliotropium",null,null,null,null,null,{"$f":"SUM(COUNTIFS(C451:F451,{\"P\",\"C\",\"D\"}))","v":0},0,null,-9,null,-9,-9,-9,31634,-9,-9,-9]
["Heliotropium polyphyllum",null,null,null,null,null,{"$f":"SUM(COUNTIFS(C452:F452,{\"P\",\"C\",\"D\"}))","v":0},0,1.67,"Not Listed","FAC","Native",3,3,31650,1,1,1]
["Hibiscus",null,null,null,null,null,{"$f":"SUM(COUNTIFS(C453:F453,{\"P\",\"C\",\"D\"}))","v":0},0,-9,"Split Genus","Var Genus",-9,4,9,21611,-9,5,3]
["Hibiscus coccineus",null,null,null,null,null,{"$f":"SUM(COUNTIFS(C454:F454,{\"P\",\"C\",\"D\"}))","v":0},0,5.45,"Not Listed","OBL","Native",3,5,21625,1,1,1]
["Hibiscus furcellatus",null,null,null,null,null,{"$f":"SUM(COUNTIFS(C455:F455,{\"P\",\"C\",\"D\"}))","v":0},0,3.89,"Not Listed",null,"Native",3,1,21630,1,5,3]
["Hibiscus grandiflorus",null,null,null,null,null,{"$f":"SUM(COUNTIFS(C456:F456,{\"P\",\"C\",\"D\"}))","v":0},0,6,"Not Listed","OBL","Native",3,5,21631,1,1,1]
["Hibiscus laevis",null,null,null,null,null,{"$f":"SUM(COUNTIFS(C457:F457,{\"P\",\"C\",\"D\"}))","v":0},0,-9,"Not Listed","OBL","Native",3,5,21632,1,1,1]
["Hibiscus moscheutos",null,null,null,null,null,{"$f":"SUM(COUNTIFS(C458:F458,{\"P\",\"C\",\"D\"}))","v":0},0,4.75,"Not Listed","OBL","Native",3,5,21612,1,5,3]
["Hibiscus tiliaceus",null,null,null,null,null,{"$f":"SUM(COUNTIFS(C459:F459,{\"P\",\"C\",\"D\"}))","v":0},0,0,"Category 2","FACW","Exotic",2,4,21618,2,null,-9]
["Hydrangea",null,null,null,null,null,{"$f":"SUM(COUNTIFS(C460:F460,{\"P\",\"C\",\"D\"}))","v":0},0,null,-9,null,-9,-9,-9,24194,-9,-9,-9]
["Hydrangea quercifolia",null,null,null,null,null,{"$f":"SUM(COUNTIFS(C461:F461,{\"P\",\"C\",\"D\"}))","v":0},0,null,-9,null,-9,-9,-9,24200,-9,-9,-9]
["Hydrilla verticillata",null,null,null,null,null,{"$f":"SUM(COUNTIFS(C462:F462,{\"P\",\"C\",\"D\"}))","v":0},0,0,"Category 1","OBL","Exotic",1,5,38974,2,1,1]
["Hydrocotyle",null,"P","P","","P",{"$f":"SUM(COUNTIFS(C463:F463,{\"P\",\"C\",\"D\"}))","v":3},3,2,"Not Listed","FACW","Native",3,4,29512,1,1,1]
["Hydrocotyle ranunculoides",null,null,null,null,null,{"$f":"SUM(COUNTIFS(C464:F464,{\"P\",\"C\",\"D\"}))","v":0},{"$f":"IF(OR(N464=3,N464=4,N464=5,N464=8,N464=9,Q464=7,O464=18036),G464,0)","v":0},2,"Not Listed","OBL","Native",3,5,29513,1,1,1]
["Hydrocotyle umbellata",null,null,null,null,null,{"$f":"SUM(COUNTIFS(C465:F465,{\"P\",\"C\",\"D\"}))","v":0},0,1.92,"Not Listed","FACW","Native",3,4,29514,1,1,1]
["Hydrocotyle verticillata",null,null,null,null,null,{"$f":"SUM(COUNTIFS(C466:F466,{\"P\",\"C\",\"D\"}))","v":0},0,2,"Not Listed","FACW","Native",3,4,29515,1,1,1]
["Hydrolea",null,null,null,null,null,{"$f":"SUM(COUNTIFS(C467:F467,{\"P\",\"C\",\"D\"}))","v":0},0,-9,"Not Listed","OBL","Native",3,5,31382,1,1,1]
["Hydrolea corymbosa",null,null,null,null,null,{"$f":"SUM(COUNTIFS(C468:F468,{\"P\",\"C\",\"D\"}))","v":0},0,5.85,"Not Listed","OBL","Native",3,5,31383,1,1,1]
["Hydrolea quadrivalvis",null,null,null,null,null,{"$f":"SUM(COUNTIFS(C469:F469,{\"P\",\"C\",\"D\"}))","v":0},0,2,"Not Listed","OBL","Native",3,5,31385,1,1,1]
["Hygrophila",null,null,null,null,null,{"$f":"SUM(COUNTIFS(C470:F470,{\"P\",\"C\",\"D\"}))","v":0},0,-9,"Split Genus","OBL",-9,4,5,34419,-9,1,1]
["Hygrophila costata","Hygrophila brasiliensis, Hygrophila lacustris",null,null,null,null,{"$f":"SUM(COUNTIFS(C471:F471,{\"P\",\"C\",\"D\"}))","v":0},0,3,"Not Listed","OBL","Native",3,5,10015301,1,1,1]
["Hygrophila polysperma",null,null,null,null,null,{"$f":"SUM(COUNTIFS(C472:F472,{\"P\",\"C\",\"D\"}))","v":0},0,0,"Category 1","OBL","Exotic",1,5,10007752,2,1,1]
["Hymenachne amplexicaulis",null,null,null,null,null,{"$f":"SUM(COUNTIFS(C473:F473,{\"P\",\"C\",\"D\"}))","v":0},0,0,"Category 1","OBL","Exotic",1,5,41778,2,2,1]
["Hymenocallis",null,null,null,null,null,{"$f":"SUM(COUNTIFS(C474:F474,{\"P\",\"C\",\"D\"}))","v":0},0,-9,"Not Listed","OBL","Native",3,5,10015356,1,1,1]
["Hypericum",null,null,null,null,null,{"$f":"SUM(COUNTIFS(C475:F475,{\"P\",\"C\",\"D\"}))","v":0},0,-9,"Not Listed","Var Genus","Native",3,9,21416,1,5,3]
["Hypericum brachyphyllum",null,null,null,null,null,{"$f":"SUM(COUNTIFS(C476:F476,{\"P\",\"C\",\"D\"}))","v":0},0,7.55,"Not Listed","FACW","Native",3,4,21428,1,4,2]
["Hypericum chapmanii",null,null,null,null,null,{"$f":"SUM(COUNTIFS(C477:F477,{\"P\",\"C\",\"D\"}))","v":0},0,5.8,"Not Listed","OBL","Native",3,5,10010631,1,4,2]
["Hypericum cistifolium",null,null,null,null,null,{"$f":"SUM(COUNTIFS(C478:F478,{\"P\",\"C\",\"D\"}))","v":0},0,6.32,"Not Listed","FACW","Native",3,4,21432,1,4,2]
["Hypericum crux-andreae",null,null,null,null,null,{"$f":"SUM(COUNTIFS(C479:F479,{\"P\",\"C\",\"D\"}))","v":0},0,0,-9,"FACW","Native",-9,4,10015806,1,4,2]
["Hypericum exile",null,null,null,null,null,{"$f":"SUM(COUNTIFS(C480:F480,{\"P\",\"C\",\"D\"}))","v":0},0,null,"Not Listed","FACW","Native",3,4,10015838,1,5,2]
["Hypericum fasciculatum",null,null,null,null,null,{"$f":"SUM(COUNTIFS(C481:F481,{\"P\",\"C\",\"D\"}))","v":0},0,8,"Not Listed","OBL","Native",3,5,21438,1,4,2]
["Hypericum galioides",null,null,null,null,null,{"$f":"SUM(COUNTIFS(C482:F482,{\"P\",\"C\",\"D\"}))","v":0},0,5.13,"Not Listed","FACW","Native",3,4,10013232,1,5,3]
["Hypericum gymnanthum",null,null,null,null,null,{"$f":"SUM(COUNTIFS(C483:F483,{\"P\",\"C\",\"D\"}))","v":0},0,4.75,"Not Listed","FACW","Native",3,4,21443,1,1,1]
["Hypericum hypericoides",null,null,null,null,null,{"$f":"SUM(COUNTIFS(C484:F484,{\"P\",\"C\",\"D\"}))","v":0},0,5.44,"Not Listed","FAC","Native",3,3,10007681,1,4,2]
["Hypericum lissophloeus",null,null,null,null,null,{"$f":"SUM(COUNTIFS(C485:F485,{\"P\",\"C\",\"D\"}))","v":0},0,9,"Not Listed","OBL","Native",3,5,10008051,1,4,2]
["Hypericum mutilum",null,null,null,null,null,{"$f":"SUM(COUNTIFS(C486:F486,{\"P\",\"C\",\"D\"}))","v":0},0,4.04,"Not Listed","FACW","Native",3,4,21421,1,1,1]
["Hypericum myrtifolium",null,null,null,null,null,{"$f":"SUM(COUNTIFS(C487:F487,{\"P\",\"C\",\"D\"}))","v":0},0,6.56,"Not Listed","FACW","Native",3,4,21450,1,4,2]
["Hypericum nitidum",null,null,null,null,null,{"$f":"SUM(COUNTIFS(C488:F488,{\"P\",\"C\",\"D\"}))","v":0},0,6.5,"Not Listed","OBL","Native",3,5,21451,1,4,2]
["Hypericum reductum",null,null,null,null,null,{"$f":"SUM(COUNTIFS(C489:F489,{\"P\",\"C\",\"D\"}))","v":0},0,5,"Not Listed","UPL","Native",3,2,21458,1,5,3]
["Hypericum tetrapetalum",null,null,null,null,null,{"$f":"SUM(COUNTIFS(C490:F490,{\"P\",\"C\",\"D\"}))","v":0},0,6.38,"Not Listed","FAC","Native",3,3,21463,1,4,2]
["Hypoxis",null,null,null,null,null,{"$f":"SUM(COUNTIFS(C491:F491,{\"P\",\"C\",\"D\"}))","v":0},0,7.15,"Not Listed","FACW","Native",3,4,10007682,1,1,1]
["Hyptis",null,null,null,null,null,{"$f":"SUM(COUNTIFS(C492:F492,{\"P\",\"C\",\"D\"}))","v":0},0,null,-9,null,-9,-9,-9,32522,-9,-9,-9]
["Hyptis alata",null,null,null,null,null,{"$f":"SUM(COUNTIFS(C493:F493,{\"P\",\"C\",\"D\"}))","v":0},0,4.58,"Not Listed","FACW","Native",3,4,32523,1,1,1]
["Ilex",null,null,null,null,null,{"$f":"SUM(COUNTIFS(C494:F494,{\"P\",\"C\",\"D\"}))","v":0},0,-9,"Not Listed","Var Genus","Native",3,9,27980,1,6,2]
["Ilex cassine",null,"P","P","P","P",{"$f":"SUM(COUNTIFS(C495:F495,{\"P\",\"C\",\"D\"}))","v":4},4,6,"Not Listed","OBL","Native",3,5,27992,1,6,2]
["Ilex coriacea",null,null,null,null,null,{"$f":"SUM(COUNTIFS(C496:F496,{\"P\",\"C\",\"D\"}))","v":0},0,3.1,"Not Listed","FACW","Native",3,4,27994,1,6,2]
["Ilex glabra",null,null,null,null,null,{"$f":"SUM(COUNTIFS(C497:F497,{\"P\",\"C\",\"D\"}))","v":0},0,5.85,"Not Listed",null,"Native",3,1,27981,1,4,2]
["Ilex myrtifolia",null,null,null,null,null,{"$f":"SUM(COUNTIFS(C498:F498,{\"P\",\"C\",\"D\"}))","v":0},0,7,"Not Listed","OBL","Native",3,5,28003,1,4,2]
["Ilex opaca",null,null,null,null,null,{"$f":"SUM(COUNTIFS(C499:F499,{\"P\",\"C\",\"D\"}))","v":0},0,4.55,"Not Listed","FAC","Native",3,3,27982,1,6,2]
["Ilex verticillata",null,null,null,null,null,{"$f":"SUM(COUNTIFS(C500:F500,{\"P\",\"C\",\"D\"}))","v":0},0,7.88,"Not Listed","OBL","Native",3,5,27985,1,4,2]
["Ilex vomitoria",null,null,null,null,null,{"$f":"SUM(COUNTIFS(C501:F501,{\"P\",\"C\",\"D\"}))","v":0},0,3,"Not Listed","FAC","Native",3,3,27986,1,6,2]
["Illicium",null,null,null,null,null,{"$f":"SUM(COUNTIFS(C502:F502,{\"P\",\"C\",\"D\"}))","v":0},0,null,"Not Listed","OBL","Native",3,5,18082,1,1,2]
["Illicium floridanum",null,null,null,null,null,{"$f":"SUM(COUNTIFS(C503:F503,{\"P\",\"C\",\"D\"}))","v":0},0,null,"Not Listed","OBL","Native",3,5,18083,1,4,2]
["Illicium parviflorum",null,null,null,null,null,{"$f":"SUM(COUNTIFS(C504:F504,{\"P\",\"C\",\"D\"}))","v":0},0,null,"Not Listed","FACW","Native",3,4,18084,1,4,2]
["Imperata",null,null,null,null,null,{"$f":"SUM(COUNTIFS(C505:F505,{\"P\",\"C\",\"D\"}))","v":0},0,null,-9,null,-9,-9,-9,41785,-9,-9,-9]
["Imperata cylindrica",null,null,null,null,null,{"$f":"SUM(COUNTIFS(C506:F506,{\"P\",\"C\",\"D\"}))","v":0},0,0,"Category 1",null,"Exotic",1,1,41788,2,2,1]
["Indigofera hirsuta",null,null,null,null,null,{"$f":"SUM(COUNTIFS(C507:F507,{\"P\",\"C\",\"D\"}))","v":0},0,-9,"Not Listed",null,"Exotic",3,1,26741,2,1,1]
["Ipomoea",null,null,null,null,null,{"$f":"SUM(COUNTIFS(C508:F508,{\"P\",\"C\",\"D\"}))","v":0},0,-9,-9,null,-9,-9,1,30758,-9,7,1]
["Ipomoea alba",null,null,null,null,null,{"$f":"SUM(COUNTIFS(C509:F509,{\"P\",\"C\",\"D\"}))","v":0},0,2.4500000000000002,-9,null,"Native",-9,-9,30760,1,null,-9]
["Ipomoea aquatica",null,null,null,null,null,{"$f":"SUM(COUNTIFS(C510:F510,{\"P\",\"C\",\"D\"}))","v":0},0,0,"Category 1",null,"Exotic",1,1,30759,2,7,1]
["Ipomoea carnea fistulosa",null,null,null,null,null,{"$f":"SUM(COUNTIFS(C511:F511,{\"P\",\"C\",\"D\"}))","v":0},0,0,"Category 2",null,"Exotic",2,-9,30769,2,-9,1]
["Ipomoea indica",null,null,null,null,null,{"$f":"SUM(COUNTIFS(C512:F512,{\"P\",\"C\",\"D\"}))","v":0},0,1.23,"Not Listed",null,"Native",3,1,30775,1,7,1]
["Ipomoea quamoclit",null,null,null,null,null,{"$f":"SUM(COUNTIFS(C513:F513,{\"P\",\"C\",\"D\"}))","v":0},0,0.26,"Not Listed",null,"Exotic",3,-9,30790,2,-9,1]
["Ipomoea sagittata",null,null,null,null,null,{"$f":"SUM(COUNTIFS(C514:F514,{\"P\",\"C\",\"D\"}))","v":0},0,6.42,"Not Listed",null,"Native",3,1,30792,1,7,1]
["Iris",null,null,null,null,null,{"$f":"SUM(COUNTIFS(C515:F515,{\"P\",\"C\",\"D\"}))","v":0},0,-9,"Not Listed","OBL",-9,3,5,43191,-9,1,1]
["Iris hexagona",null,null,null,null,null,{"$f":"SUM(COUNTIFS(C516:F516,{\"P\",\"C\",\"D\"}))","v":0},0,6.97,"Not Listed","OBL","Native",3,5,43214,1,1,1]
["Iris pseudacorus",null,null,null,null,null,{"$f":"SUM(COUNTIFS(C517:F517,{\"P\",\"C\",\"D\"}))","v":0},0,0,"Not Listed","OBL","Exotic",3,5,43194,2,1,1]
["Iris virginica",null,null,null,null,null,{"$f":"SUM(COUNTIFS(C518:F518,{\"P\",\"C\",\"D\"}))","v":0},0,5.5,"Not Listed","OBL","Native",3,5,10009131,1,1,1]
["Itea virginica",null,null,null,null,null,{"$f":"SUM(COUNTIFS(C519:F519,{\"P\",\"C\",\"D\"}))","v":0},0,7.09,"Not Listed","OBL","Native",3,5,24202,1,4,2]
["Iva",null,null,null,null,null,{"$f":"SUM(COUNTIFS(C520:F520,{\"P\",\"C\",\"D\"}))","v":0},0,null,-9,null,-9,-9,-9,36024,-9,-9,-9]
["Iva frutescens",null,null,null,null,null,{"$f":"SUM(COUNTIFS(C521:F521,{\"P\",\"C\",\"D\"}))","v":0},0,5.08,"Not Listed","OBL","Native",3,5,36025,1,4,2]
["Iva microcephala",null,null,null,null,null,{"$f":"SUM(COUNTIFS(C522:F522,{\"P\",\"C\",\"D\"}))","v":0},0,4.68,"Not Listed","FACW","Native",3,4,36039,1,1,1]
["Juncus",null,null,null,null,null,{"$f":"SUM(COUNTIFS(C523:F523,{\"P\",\"C\",\"D\"}))","v":0},0,-9,-9,"Var Genus","Native",-9,9,39220,1,2,1]
["Juncus abortivus",null,null,null,null,null,{"$f":"SUM(COUNTIFS(C524:F524,{\"P\",\"C\",\"D\"}))","v":0},0,2,"Not Listed","OBL","Native",3,5,39245,1,null,1]
["Juncus acuminatus",null,null,null,null,null,{"$f":"SUM(COUNTIFS(C525:F525,{\"P\",\"C\",\"D\"}))","v":0},0,2.25,"Not Listed","OBL","Native",3,5,39221,1,2,1]
["Juncus canadensis",null,null,null,null,null,{"$f":"SUM(COUNTIFS(C526:F526,{\"P\",\"C\",\"D\"}))","v":0},0,5.5,"Not Listed","OBL","Native",3,5,39228,1,2,1]
["Juncus coriaceus",null,null,null,null,null,{"$f":"SUM(COUNTIFS(C527:F527,{\"P\",\"C\",\"D\"}))","v":0},0,8.51,"Not Listed","OBL","Native",3,5,39230,1,2,1]
["Juncus debilis",null,null,null,null,null,{"$f":"SUM(COUNTIFS(C528:F528,{\"P\",\"C\",\"D\"}))","v":0},{"$f":"IF(OR(N528=3,N528=4,N528=5,N528=8,N528=9,Q528=7,O528=18036),G528,0)","v":0},-9,"Not Listed","OBL","Native",3,5,39231,1,2,1]
["Juncus dichotomus",null,null,null,null,null,{"$f":"SUM(COUNTIFS(C529:F529,{\"P\",\"C\",\"D\"}))","v":0},0,2.83,"Not Listed","OBL","Native",3,5,39264,1,2,1]
["Juncus diffusissimus",null,null,null,null,null,{"$f":"SUM(COUNTIFS(C530:F530,{\"P\",\"C\",\"D\"}))","v":0},0,3,"Not Listed","OBL","Native",3,5,39265,1,2,1]
["Juncus effusus",null,null,null,null,null,{"$f":"SUM(COUNTIFS(C531:F531,{\"P\",\"C\",\"D\"}))","v":0},0,2,"Not Listed","OBL","Native",3,5,39232,1,2,1]
["Juncus elliottii",null,null,null,null,null,{"$f":"SUM(COUNTIFS(C532:F532,{\"P\",\"C\",\"D\"}))","v":0},0,3.11,"Not Listed","OBL","Native",3,5,39233,1,2,1]
["Juncus gymnocarpus",null,null,null,null,null,{"$f":"SUM(COUNTIFS(C533:F533,{\"P\",\"C\",\"D\"}))","v":0},0,null,"Not Listed","OBL","Native",3,5,39274,1,2,1]
["Juncus marginatus",null,null,null,null,null,{"$f":"SUM(COUNTIFS(C534:F534,{\"P\",\"C\",\"D\"}))","v":0},0,1.5,"Not Listed","FACW","Native",3,4,39289,1,2,1]
["Juncus megacephalus",null,null,null,null,null,{"$f":"SUM(COUNTIFS(C535:F535,{\"P\",\"C\",\"D\"}))","v":0},0,3.5,"Not Listed","OBL","Native",3,5,39291,1,2,1]
["Juncus pelocarpus","Juncus abortivus",null,null,null,null,{"$f":"SUM(COUNTIFS(C536:F536,{\"P\",\"C\",\"D\"}))","v":0},0,2,"Not Listed","OBL","Native",3,5,39302,1,2,1]
["Juncus polycephalus",null,null,null,null,null,{"$f":"SUM(COUNTIFS(C537:F537,{\"P\",\"C\",\"D\"}))","v":0},0,4.96,"Not Listed","OBL","Native",3,5,39307,1,2,1]
["Juncus repens",null,null,null,null,null,{"$f":"SUM(COUNTIFS(C538:F538,{\"P\",\"C\",\"D\"}))","v":0},0,5,"Not Listed","OBL","Native",3,5,39309,1,2,1]
["Juncus roemerianus",null,null,null,null,null,{"$f":"SUM(COUNTIFS(C539:F539,{\"P\",\"C\",\"D\"}))","v":0},0,7.09,"Not Listed","OBL","Native",3,5,39238,1,2,1]
["Juncus scirpoides",null,null,null,null,null,{"$f":"SUM(COUNTIFS(C540:F540,{\"P\",\"C\",\"D\"}))","v":0},0,4.33,"Not Listed","OBL","Native",3,5,39312,1,2,1]
["Juncus tenuis",null,null,null,null,null,{"$f":"SUM(COUNTIFS(C541:F541,{\"P\",\"C\",\"D\"}))","v":0},0,2.25,"Not Listed","FAC","Native",3,3,39243,1,2,1]
["Juncus trigonocarpus",null,null,null,null,null,{"$f":"SUM(COUNTIFS(C542:F542,{\"P\",\"C\",\"D\"}))","v":0},0,4.17,"Not Listed","OBL","Native",3,5,39324,1,2,1]
["Juncus validus",null,null,null,null,null,{"$f":"SUM(COUNTIFS(C543:F543,{\"P\",\"C\",\"D\"}))","v":0},0,3.63,"Not Listed","OBL","Native",3,5,39327,1,2,1]
["Juniperus",null,null,null,null,null,{"$f":"SUM(COUNTIFS(C544:F544,{\"P\",\"C\",\"D\"}))","v":0},0,-9,"Not Listed",null,-9,3,1,18047,-9,6,2]
["Juniperus virginiana","Juniperus silicicola, Juniperus virginiana silicicola",null,null,null,null,{"$f":"SUM(COUNTIFS(C545:F545,{\"P\",\"C\",\"D\"}))","v":0},0,6.25,"Not Listed",null,"Native",3,1,18048,1,6,2]
["Justicia",null,null,null,null,null,{"$f":"SUM(COUNTIFS(C546:F546,{\"P\",\"C\",\"D\"}))","v":0},0,-9,"Not Listed","OBL",-9,3,5,34351,-9,1,1]
["Justicia angusta",null,null,null,null,null,{"$f":"SUM(COUNTIFS(C547:F547,{\"P\",\"C\",\"D\"}))","v":0},0,null,"Not Listed","OBL","Native",3,5,10015937,1,1,1]
["Justicia ovata",null,null,null,null,null,{"$f":"SUM(COUNTIFS(C548:F548,{\"P\",\"C\",\"D\"}))","v":0},0,8.8800000000000008,"Not Listed","OBL","Native",3,5,34357,1,1,1]
["Kalmia",null,null,null,null,null,{"$f":"SUM(COUNTIFS(C549:F549,{\"P\",\"C\",\"D\"}))","v":0},0,-9,"Not Listed","Var Genus",-9,3,9,23672,-9,4,2]
["Kalmia latifolia",null,null,null,null,null,{"$f":"SUM(COUNTIFS(C550:F550,{\"P\",\"C\",\"D\"}))","v":0},0,7,"Not Listed","FACW","Native",3,4,23677,1,4,2]
["Kosteletzkya",null,null,null,null,null,{"$f":"SUM(COUNTIFS(C551:F551,{\"P\",\"C\",\"D\"}))","v":0},0,-9,"Not Listed","Var Genus",-9,3,9,21654,-9,5,3]
["Kosteletzkya pentacarpos","Kosteletzkya virginica",null,null,null,null,{"$f":"SUM(COUNTIFS(C552:F552,{\"P\",\"C\",\"D\"}))","v":0},0,6,"Not Listed","OBL","Native",3,5,10015499,1,5,3]
["Kummerowia striata",null,null,null,null,null,{"$f":"SUM(COUNTIFS(C553:F553,{\"P\",\"C\",\"D\"}))","v":0},0,0,"Not Listed",null,"Exotic",3,-9,10007721,2,null,1]
["Kyllinga",null,null,null,null,null,{"$f":"SUM(COUNTIFS(C554:F554,{\"P\",\"C\",\"D\"}))","v":0},0,-9,"Not Listed","FACW",-9,3,4,10009312,-9,2,1]
["Kyllinga brevifolia",null,null,null,null,null,{"$f":"SUM(COUNTIFS(C555:F555,{\"P\",\"C\",\"D\"}))","v":0},0,1.42,"Not Listed","FACW","Native",3,4,10009313,1,2,1]
["Kyllinga odorata",null,null,null,null,null,{"$f":"SUM(COUNTIFS(C556:F556,{\"P\",\"C\",\"D\"}))","v":0},0,2.17,"Not Listed","FACW","Native",3,4,10015581,1,2,1]
["Kyllinga pumila",null,null,null,null,null,{"$f":"SUM(COUNTIFS(C557:F557,{\"P\",\"C\",\"D\"}))","v":0},0,1.38,"Not Listed","FACW","Native",3,4,10012251,1,2,1]
["Lachnanthes caroliniana",null,null,null,null,null,{"$f":"SUM(COUNTIFS(C558:F558,{\"P\",\"C\",\"D\"}))","v":0},0,3.76,"Not Listed","FAC","Native",3,3,43329,1,1,1]
["Lachnocaulon",null,null,null,null,null,{"$f":"SUM(COUNTIFS(C559:F559,{\"P\",\"C\",\"D\"}))","v":0},0,-9,"Not Listed","Var Genus","Native",3,9,39204,1,1,1]
["Lachnocaulon anceps",null,null,null,null,null,{"$f":"SUM(COUNTIFS(C560:F560,{\"P\",\"C\",\"D\"}))","v":0},0,5.5,"Not Listed","FACW","Native",3,4,39205,1,1,1]
["Lachnocaulon beyrichianum",null,null,null,null,null,{"$f":"SUM(COUNTIFS(C561:F561,{\"P\",\"C\",\"D\"}))","v":0},0,9.18,"Not Listed","FACW","Native",3,4,10007683,1,1,1]
["Lachnocaulon engleri",null,null,null,null,null,{"$f":"SUM(COUNTIFS(C562:F562,{\"P\",\"C\",\"D\"}))","v":0},0,1,"Not Listed","OBL","Native",3,5,39208,1,1,1]
["Lachnocaulon minus",null,null,null,null,null,{"$f":"SUM(COUNTIFS(C563:F563,{\"P\",\"C\",\"D\"}))","v":0},0,7.97,"Not Listed","OBL","Native",3,5,39209,1,1,1]
["Landoltia punctata","Spirodela punctata, Spirodela oligorrhiza",null,null,null,null,{"$f":"SUM(COUNTIFS(C564:F564,{\"P\",\"C\",\"D\"}))","v":0},0,0,"Category 2","UPL","Exotic",2,2,10014991,2,1,1]
["Lantana",null,null,null,null,null,{"$f":"SUM(COUNTIFS(C565:F565,{\"P\",\"C\",\"D\"}))","v":0},0,-9,"Not Listed",null,-9,3,1,32173,-9,5,3]
["Lechea cernua",null,null,null,null,null,{"$f":"SUM(COUNTIFS(C566:F566,{\"P\",\"C\",\"D\"}))","v":0},0,8.67,"Not Listed",null,"Native",3,-9,22283,1,null,1]
["Leersia",null,null,null,null,null,{"$f":"SUM(COUNTIFS(C567:F567,{\"P\",\"C\",\"D\"}))","v":0},0,-9,"Not Listed","OBL","Native",3,5,40885,1,2,1]
["Leersia hexandra",null,null,null,null,null,{"$f":"SUM(COUNTIFS(C568:F568,{\"P\",\"C\",\"D\"}))","v":0},0,5.61,"Not Listed","OBL","Native",3,5,40887,1,2,1]
["Leersia lenticularis",null,null,null,null,null,{"$f":"SUM(COUNTIFS(C569:F569,{\"P\",\"C\",\"D\"}))","v":0},0,null,"Not Listed","OBL","Native",3,5,40888,1,2,1]
["Leersia oryzoides",null,null,null,null,null,{"$f":"SUM(COUNTIFS(C570:F570,{\"P\",\"C\",\"D\"}))","v":0},0,4,"Not Listed","OBL","Native",3,5,40886,1,2,1]
["Leersia virginica",null,null,null,null,null,{"$f":"SUM(COUNTIFS(C571:F571,{\"P\",\"C\",\"D\"}))","v":0},0,null,"Not Listed","OBL","Native",3,5,40890,1,2,1]
["Lemna",null,"P","","P","P",{"$f":"SUM(COUNTIFS(C572:F572,{\"P\",\"C\",\"D\"}))","v":3},3,1,"Not Listed","OBL","Native",3,5,42588,1,1,1]
["Lemna minor",null,null,null,null,null,{"$f":"SUM(COUNTIFS(C573:F573,{\"P\",\"C\",\"D\"}))","v":0},0,1,"Not Listed","OBL","Native",3,5,42590,1,1,1]
["Leptochloa fascicularis",null,null,null,null,null,{"$f":"SUM(COUNTIFS(C574:F574,{\"P\",\"C\",\"D\"}))","v":0},0,4.55,"Not Listed","FACW","Native",3,4,41825,1,2,1]
["Leucaena leucocephala",null,null,null,null,null,{"$f":"SUM(COUNTIFS(C575:F575,{\"P\",\"C\",\"D\"}))","v":0},0,0,"Category 2","UPL","Exotic",2,2,26766,2,6,2]
["Leucothoe axillaris","Andromeda axillaris",null,null,null,null,{"$f":"SUM(COUNTIFS(C576:F576,{\"P\",\"C\",\"D\"}))","v":0},0,6,"Not Listed","FACW","Native",3,4,23550,1,4,2]
["Leucothoe racemosa",null,null,null,null,null,{"$f":"SUM(COUNTIFS(C577:F577,{\"P\",\"C\",\"D\"}))","v":0},0,8,"Not Listed","FACW","Native",3,4,23549,1,4,2]
["Leucothoe(plant)",null,null,null,null,null,{"$f":"SUM(COUNTIFS(C578:F578,{\"P\",\"C\",\"D\"}))","v":0},0,null,-9,null,-9,-9,-9,23547,-9,-9,-9]
["Liatris",null,null,null,null,null,{"$f":"SUM(COUNTIFS(C579:F579,{\"P\",\"C\",\"D\"}))","v":0},0,-9,"Not Listed","Var Genus",-9,3,9,37906,-9,1,1]
["Ligustrum",null,null,null,null,null,{"$f":"SUM(COUNTIFS(C580:F580,{\"P\",\"C\",\"D\"}))","v":0},0,null,-9,null,-9,-9,-9,32973,-9,-9,-9]
["Ligustrum sinense",null,null,null,null,null,{"$f":"SUM(COUNTIFS(C581:F581,{\"P\",\"C\",\"D\"}))","v":0},0,0,"Category 1",null,"Exotic",1,1,32979,2,4,2]
["Lilaeopsis",null,null,null,null,null,{"$f":"SUM(COUNTIFS(C582:F582,{\"P\",\"C\",\"D\"}))","v":0},0,-9,"Not Listed","OBL","Native",3,5,29537,1,1,1]
["Lilaeopsis carolinensis",null,null,null,null,null,{"$f":"SUM(COUNTIFS(C583:F583,{\"P\",\"C\",\"D\"}))","v":0},0,-9,"Not Listed","OBL","Native",3,5,10015767,1,1,1]
["Limnobium spongia",null,null,null,null,null,{"$f":"SUM(COUNTIFS(C584:F584,{\"P\",\"C\",\"D\"}))","v":0},0,2.5,"Not Listed","OBL","Native",3,5,38948,1,1,1]
["Limnophila","Limnophila(magnoliophyta)",null,null,null,null,{"$f":"SUM(COUNTIFS(C585:F585,{\"P\",\"C\",\"D\"}))","v":0},0,null,-9,null,-9,-9,-9,33633,-9,-9,-9]
["Limnophila sessiliflora",null,null,null,null,null,{"$f":"SUM(COUNTIFS(C586:F586,{\"P\",\"C\",\"D\"}))","v":0},0,0,"Category 2","OBL","Exotic",2,5,33635,2,1,1]
["Lindernia",null,null,null,null,null,{"$f":"SUM(COUNTIFS(C587:F587,{\"P\",\"C\",\"D\"}))","v":0},0,-9,"Not Listed","Var Genus",-9,3,9,33220,-9,1,1]
["Lindernia anagallidea",null,null,null,null,null,{"$f":"SUM(COUNTIFS(C588:F588,{\"P\",\"C\",\"D\"}))","v":0},0,5.57,"Not Listed","FACW","Native",3,4,33222,1,1,1]
["Lindernia crustacea",null,null,null,null,null,{"$f":"SUM(COUNTIFS(C589:F589,{\"P\",\"C\",\"D\"}))","v":0},0,0.27,"Not Listed","FAC","Exotic",3,3,33223,2,1,1]
["Lindernia dubia",null,null,null,null,null,{"$f":"SUM(COUNTIFS(C590:F590,{\"P\",\"C\",\"D\"}))","v":0},0,null,"Not Listed","OBL","Native",3,5,33221,1,1,1]
["Lindernia grandiflora",null,null,null,null,null,{"$f":"SUM(COUNTIFS(C591:F591,{\"P\",\"C\",\"D\"}))","v":0},0,3.6,"Not Listed","FACW","Native",3,4,33224,1,1,1]
["Linum",null,null,null,null,null,{"$f":"SUM(COUNTIFS(C592:F592,{\"P\",\"C\",\"D\"}))","v":0},{"$f":"IF(OR(N592=3,N592=4,N592=5,N592=8,N592=9,Q592=7,O592=18036),G592,0)","v":0},-9,"Not Listed","Var Genus",-9,3,9,29201,-9,1,1]
["Lipocarpha",null,null,null,null,null,{"$f":"SUM(COUNTIFS(C593:F593,{\"P\",\"C\",\"D\"}))","v":0},0,null,-9,null,-9,-9,-9,40288,-9,-9,-9]
["Lipocarpha maculata",null,null,null,null,null,{"$f":"SUM(COUNTIFS(C594:F594,{\"P\",\"C\",\"D\"}))","v":0},0,4.55,"Not Listed","FACW","Native",3,4,40289,1,2,1]
["Lippia stoechadifolia",null,null,null,null,null,{"$f":"SUM(COUNTIFS(C595:F595,{\"P\",\"C\",\"D\"}))","v":0},0,null,"Not Listed","FAC","Native",3,3,10015921,1,1,1]
["Liquidambar styraciflua",null,"","","P","P",{"$f":"SUM(COUNTIFS(C596:F596,{\"P\",\"C\",\"D\"}))","v":2},2,2.5,"Not Listed","FACW","Native",3,4,19027,1,6,2]
["Liriodendron tulipifera",null,null,null,null,null,{"$f":"SUM(COUNTIFS(C597:F597,{\"P\",\"C\",\"D\"}))","v":0},0,6.67,"Not Listed","FACW","Native",3,4,18086,1,6,2]
["Lobelia",null,null,null,null,null,{"$f":"SUM(COUNTIFS(C598:F598,{\"P\",\"C\",\"D\"}))","v":0},0,null,-9,null,-9,-9,-9,34503,-9,-9,-9]
["Lobelia cardinalis",null,null,null,null,null,{"$f":"SUM(COUNTIFS(C599:F599,{\"P\",\"C\",\"D\"}))","v":0},0,6,"Not Listed","OBL","Native",3,5,34505,1,1,1]
["Lobelia floridana",null,null,null,null,null,{"$f":"SUM(COUNTIFS(C600:F600,{\"P\",\"C\",\"D\"}))","v":0},0,null,-9,null,"Native",-9,-9,34521,1]
["Lobelia glandulosa",null,null,null,null,null,{"$f":"SUM(COUNTIFS(C601:F601,{\"P\",\"C\",\"D\"}))","v":0},0,6.03,"Not Listed","FACW","Native",3,4,34522,1,null,1]
["Lobelia paludosa",null,null,null,null,null,{"$f":"SUM(COUNTIFS(C602:F602,{\"P\",\"C\",\"D\"}))","v":0},0,8.08,"Not Listed","FACW","Native",3,4,34528,1,null,1]
["Lophiola americana","Lophiola aurea",null,null,null,null,{"$f":"SUM(COUNTIFS(C603:F603,{\"P\",\"C\",\"D\"}))","v":0},0,null,-9,-9,-9,-9,-9,43331,-9,-9,-9]
["Lophiola aurea","Lophiola americana",null,null,null,null,{"$f":"SUM(COUNTIFS(C604:F604,{\"P\",\"C\",\"D\"}))","v":0},0,null,-9,null,-9,-9,-9,43331,-9,-9,-9]
["Ludwigia (native)",null,null,null,null,null,{"$f":"SUM(COUNTIFS(C605:F605,{\"P\",\"C\",\"D\"}))","v":0},0,-9,"Not Listed","Var Genus","Native",3,9,10015739,1,1,1]
["Ludwigia (unknown nativity)",null,null,null,null,null,{"$f":"SUM(COUNTIFS(C606:F606,{\"P\",\"C\",\"D\"}))","v":0},0,-9,-9,"OBL",-9,-9,5,27334,-9,5,3]
["Ludwigia alata",null,null,null,null,null,{"$f":"SUM(COUNTIFS(C607:F607,{\"P\",\"C\",\"D\"}))","v":0},0,5.85,"Not Listed","OBL","Native",3,5,27338,1,1,1]
["Ludwigia alternifolia",null,null,null,null,null,{"$f":"SUM(COUNTIFS(C608:F608,{\"P\",\"C\",\"D\"}))","v":0},0,6.24,"Not Listed","OBL","Native",3,5,27335,1,1,1]
["Ludwigia arcuata",null,null,null,null,null,{"$f":"SUM(COUNTIFS(C609:F609,{\"P\",\"C\",\"D\"}))","v":0},0,3.5,"Not Listed","OBL","Native",3,5,27339,1,1,1]
["Ludwigia decurrens",null,null,null,null,null,{"$f":"SUM(COUNTIFS(C610:F610,{\"P\",\"C\",\"D\"}))","v":0},0,5.7,"Not Listed","OBL","Native",3,5,27343,1,1,1]
["Ludwigia erecta",null,null,null,null,null,{"$f":"SUM(COUNTIFS(C611:F611,{\"P\",\"C\",\"D\"}))","v":0},0,2.5499999999999998,"Not Listed","OBL","Native",3,5,27344,1,1,1]
["Ludwigia glandulosa",null,null,null,null,null,{"$f":"SUM(COUNTIFS(C612:F612,{\"P\",\"C\",\"D\"}))","v":0},0,3.21,"Not Listed","OBL","Native",3,5,27345,1,1,1]
["Ludwigia grandiflora",null,null,null,null,null,{"$f":"SUM(COUNTIFS(C613:F613,{\"P\",\"C\",\"D\"}))","v":0},0,0,"Not Listed","OBL","Exotic",3,5,10009071,2,5,3]
["Ludwigia hexapetala",null,null,null,null,null,{"$f":"SUM(COUNTIFS(C614:F614,{\"P\",\"C\",\"D\"}))","v":0},0,0,"Not Listed","OBL","Exotic",3,5,10008771,2,5,3]
["Ludwigia lanceolata",null,null,null,null,null,{"$f":"SUM(COUNTIFS(C615:F615,{\"P\",\"C\",\"D\"}))","v":0},0,6.15,"Not Listed","OBL","Native",3,5,27348,1,1,1]
["Ludwigia leptocarpa",null,null,null,null,null,{"$f":"SUM(COUNTIFS(C616:F616,{\"P\",\"C\",\"D\"}))","v":0},0,3,"Not Listed","OBL","Native",3,5,27349,1,1,1]
["Ludwigia linearis",null,null,null,null,null,{"$f":"SUM(COUNTIFS(C617:F617,{\"P\",\"C\",\"D\"}))","v":0},0,5.72,"Not Listed","OBL","Native",3,5,27350,1,1,1]
["Ludwigia linifolia",null,null,null,null,null,{"$f":"SUM(COUNTIFS(C618:F618,{\"P\",\"C\",\"D\"}))","v":0},0,7.04,"Not Listed","OBL","Native",3,5,27351,1,1,1]
["Ludwigia maritima",null,null,null,null,null,{"$f":"SUM(COUNTIFS(C619:F619,{\"P\",\"C\",\"D\"}))","v":0},0,5.85,"Not Listed","FACW","Native",3,4,27352,1,1,1]
["Ludwigia microcarpa",null,null,null,null,null,{"$f":"SUM(COUNTIFS(C620:F620,{\"P\",\"C\",\"D\"}))","v":0},0,4.8099999999999996,"Not Listed","OBL","Native",3,5,27353,1,1,1]
["Ludwigia octovalvis",null,null,null,null,null,{"$f":"SUM(COUNTIFS(C621:F621,{\"P\",\"C\",\"D\"}))","v":0},0,2,"Not Listed","OBL","Native",3,5,10007684,1,1,1]
["Ludwigia palustris",null,null,null,null,null,{"$f":"SUM(COUNTIFS(C622:F622,{\"P\",\"C\",\"D\"}))","v":0},0,4.7699999999999996,"Not Listed","OBL","Native",3,5,27336,1,1,1]
["Ludwigia peploides",null,null,null,null,null,{"$f":"SUM(COUNTIFS(C623:F623,{\"P\",\"C\",\"D\"}))","v":0},0,4,"Not Listed","OBL","Native",3,5,27355,1,1,1]
["Ludwigia peruviana",null,"P","","","P",{"$f":"SUM(COUNTIFS(C624:F624,{\"P\",\"C\",\"D\"}))","v":2},2,0,"Category 1","OBL","Exotic",1,5,27359,2,1,1]
["Ludwigia pilosa",null,null,null,null,null,{"$f":"SUM(COUNTIFS(C625:F625,{\"P\",\"C\",\"D\"}))","v":0},0,4.5,"Not Listed","OBL","Native",3,5,27360,1,1,1]
["Ludwigia polycarpa",null,null,null,null,null,{"$f":"SUM(COUNTIFS(C626:F626,{\"P\",\"C\",\"D\"}))","v":0},0,-9,"Not Listed","OBL","Native",3,5,27361,1,1,1]
["Ludwigia repens",null,null,null,null,null,{"$f":"SUM(COUNTIFS(C627:F627,{\"P\",\"C\",\"D\"}))","v":0},0,3.2,"Not Listed","OBL","Native",3,5,27362,1,1,1]
["Ludwigia sphaerocarpa",null,null,null,null,null,{"$f":"SUM(COUNTIFS(C628:F628,{\"P\",\"C\",\"D\"}))","v":0},0,2.5,"Not Listed","OBL","Native",3,5,27337,1,1,1]
["Ludwigia suffruticosa",null,null,null,null,null,{"$f":"SUM(COUNTIFS(C629:F629,{\"P\",\"C\",\"D\"}))","v":0},0,6.23,"Not Listed","FACW","Native",3,4,27364,1,1,1]
["Ludwigia uruguayensis",null,null,null,null,null,{"$f":"SUM(COUNTIFS(C630:F630,{\"P\",\"C\",\"D\"}))","v":0},0,0,"Not Listed","OBL","Exotic",3,5,27365,2,5,3]
["Ludwigia virgata",null,null,null,null,null,{"$f":"SUM(COUNTIFS(C631:F631,{\"P\",\"C\",\"D\"}))","v":0},0,6.73,"Not Listed","FACW","Native",3,4,27366,1,1,1]
["Luziola",null,null,null,null,null,{"$f":"SUM(COUNTIFS(C632:F632,{\"P\",\"C\",\"D\"}))","v":0},0,-9,"Split Genus","OBL",-9,4,5,41835,-9,2,1]
["Luziola bahiensis",null,null,null,null,null,{"$f":"SUM(COUNTIFS(C633:F633,{\"P\",\"C\",\"D\"}))","v":0},0,2.67,"Not Listed","OBL","Native",3,5,41836,1,2,1]
["Luziola fluitans","Hydrochloa caroliniensis",null,null,null,null,{"$f":"SUM(COUNTIFS(C634:F634,{\"P\",\"C\",\"D\"}))","v":0},0,4,"Not Listed","OBL","Native",3,5,10008952,1,2,1]
["Lycopodiella alopecuroides","Lycopodium alopecuroides",null,null,null,null,{"$f":"SUM(COUNTIFS(C635:F635,{\"P\",\"C\",\"D\"}))","v":0},0,5.75,"Not Listed","FACW","Native",3,4,10009052,1,1,1]
["Lycopodium appressum",null,null,null,null,null,{"$f":"SUM(COUNTIFS(C636:F636,{\"P\",\"C\",\"D\"}))","v":0},0,7.89,"Not Listed","FACW","Native",3,4,17019,1,1,1]
["Lycopus",null,null,null,null,null,{"$f":"SUM(COUNTIFS(C637:F637,{\"P\",\"C\",\"D\"}))","v":0},0,-9,"Not Listed","OBL","Native",3,5,32253,1,1,1]
["Lycopus americanus",null,null,null,null,null,{"$f":"SUM(COUNTIFS(C638:F638,{\"P\",\"C\",\"D\"}))","v":0},0,3.17,"Not Listed","OBL","Native",3,5,32254,1,1,1]
["Lycopus amplectens",null,null,null,null,null,{"$f":"SUM(COUNTIFS(C639:F639,{\"P\",\"C\",\"D\"}))","v":0},0,2.88,"Not Listed","OBL","Native",3,5,10009151,1,1,1]
["Lycopus rubellus",null,null,null,null,null,{"$f":"SUM(COUNTIFS(C640:F640,{\"P\",\"C\",\"D\"}))","v":0},0,4,"Not Listed","OBL","Native",3,5,32261,1,1,1]
["Lycopus virginicus",null,null,null,null,null,{"$f":"SUM(COUNTIFS(C641:F641,{\"P\",\"C\",\"D\"}))","v":0},0,5,"Not Listed","OBL","Native",3,5,32255,1,1,1]
["Lygodium",null,null,null,null,null,{"$f":"SUM(COUNTIFS(C642:F642,{\"P\",\"C\",\"D\"}))","v":0},0,null,"Category 1",null,"Exotic",1,1,17982,2,7,1]
["Lygodium japonicum",null,null,null,null,null,{"$f":"SUM(COUNTIFS(C643:F643,{\"P\",\"C\",\"D\"}))","v":0},0,0,"Category 1",null,"Exotic",1,1,17983,2,7,1]
["Lygodium microphyllum",null,null,null,null,null,{"$f":"SUM(COUNTIFS(C644:F644,{\"P\",\"C\",\"D\"}))","v":0},0,0,"Category 1",null,"Exotic",1,1,17984,2,7,1]
["Lyonia",null,null,null,null,null,{"$f":"SUM(COUNTIFS(C645:F645,{\"P\",\"C\",\"D\"}))","v":0},0,-9,"Not Listed","Var Genus","Native",3,9,23558,1,4,2]
["Lyonia ferruginea","Andromeda ferruginea",null,null,null,null,{"$f":"SUM(COUNTIFS(C646:F646,{\"P\",\"C\",\"D\"}))","v":0},0,8.39,"Not Listed",null,"Native",3,1,23560,1,4,2]
["Lyonia fruticosa",null,null,null,null,null,{"$f":"SUM(COUNTIFS(C647:F647,{\"P\",\"C\",\"D\"}))","v":0},0,5.93,"Not Listed",null,"Native",3,1,23562,1,4,2]
["Lyonia ligustrina",null,null,null,null,null,{"$f":"SUM(COUNTIFS(C648:F648,{\"P\",\"C\",\"D\"}))","v":0},0,8.67,"Not Listed","FAC","Native",3,3,23559,1,4,2]
["Lyonia lucida",null,null,null,null,null,{"$f":"SUM(COUNTIFS(C649:F649,{\"P\",\"C\",\"D\"}))","v":0},0,6,"Not Listed","FACW","Native",3,4,23563,1,4,2]
["Lyonia mariana","Pieris mariana",null,null,null,null,{"$f":"SUM(COUNTIFS(C650:F650,{\"P\",\"C\",\"D\"}))","v":0},0,4.8,"Not Listed","FACW","Native",3,4,23564,1,4,2]
["Lythrum",null,null,null,null,null,{"$f":"SUM(COUNTIFS(C651:F651,{\"P\",\"C\",\"D\"}))","v":0},0,null,-9,null,-9,-9,-9,27077,-9,-9,-9]
["Lythrum alatum",null,null,null,null,null,{"$f":"SUM(COUNTIFS(C652:F652,{\"P\",\"C\",\"D\"}))","v":0},0,3.55,"Not Listed","OBL","Native",3,5,27081,1,1,1]
["Lythrum flagellare",null,null,null,null,null,{"$f":"SUM(COUNTIFS(C653:F653,{\"P\",\"C\",\"D\"}))","v":0},0,null,"Not Listed","OBL","Native",3,5,27084,1,1,1]
["Lythrum lineare",null,null,null,null,null,{"$f":"SUM(COUNTIFS(C654:F654,{\"P\",\"C\",\"D\"}))","v":0},0,3.82,"Not Listed","OBL","Native",3,5,27078,1,1,1]
["Macroptilium lathyroides",null,null,null,null,null,{"$f":"SUM(COUNTIFS(C655:F655,{\"P\",\"C\",\"D\"}))","v":0},0,0.41,"Not Listed",null,"Exotic",3,1,10007723,2,1,1]
["Macrothelypteris torresiana",null,null,null,null,null,{"$f":"SUM(COUNTIFS(C656:F656,{\"P\",\"C\",\"D\"}))","v":0},{"$f":"IF(OR(N656=3,N656=4,N656=5,N656=8,N656=9,Q656=7,O656=18036),G656,0)","v":0},null,"Not Listed",null,"Exotic",3,1,10015883,2,1,1]
["Magnolia",null,null,null,null,null,{"$f":"SUM(COUNTIFS(C657:F657,{\"P\",\"C\",\"D\"}))","v":0},0,-9,"Not Listed","Var Genus",-9,3,9,18069,-9,6,2]
["Magnolia grandiflora",null,null,null,null,null,{"$f":"SUM(COUNTIFS(C658:F658,{\"P\",\"C\",\"D\"}))","v":0},0,4.3600000000000003,"Not Listed",null,"Native",3,1,18074,1,6,2]
["Magnolia virginiana",null,null,null,null,null,{"$f":"SUM(COUNTIFS(C659:F659,{\"P\",\"C\",\"D\"}))","v":0},0,7,"Not Listed","OBL","Native",3,5,18070,1,6,2]
["Marsilea",null,null,null,null,null,{"$f":"SUM(COUNTIFS(C660:F660,{\"P\",\"C\",\"D\"}))","v":0},0,null,-9,null,-9,-9,-9,17992,-9,-9,-9]
["Marsilea quadrifolia",null,null,null,null,null,{"$f":"SUM(COUNTIFS(C661:F661,{\"P\",\"C\",\"D\"}))","v":0},0,null,-9,null,-9,-9,-9,17995,-9,-9,-9]
["Mayaca fluviatilis",null,null,null,null,null,{"$f":"SUM(COUNTIFS(C662:F662,{\"P\",\"C\",\"D\"}))","v":0},0,8.4499999999999993,"Not Listed","OBL","Native",3,5,39122,1,1,1]
["Melaleuca",null,null,null,null,null,{"$f":"SUM(COUNTIFS(C663:F663,{\"P\",\"C\",\"D\"}))","v":0},0,-9,"Split Genus","Var Genus","Exotic",4,9,27227,2,6,2]
["Melaleuca quinquenervia",null,null,null,null,null,{"$f":"SUM(COUNTIFS(C664:F664,{\"P\",\"C\",\"D\"}))","v":0},0,0,"Category 1","FAC","Exotic",1,3,27228,2,6,2]
["Melaleuca viminalis",null,null,null,null,null,{"$f":"SUM(COUNTIFS(C665:F665,{\"P\",\"C\",\"D\"}))","v":0},0,0,-9,null,"Exotic",-9,-9,10015953,2,6,2]
["Melanthera nivea",null,null,null,null,null,{"$f":"SUM(COUNTIFS(C666:F666,{\"P\",\"C\",\"D\"}))","v":0},0,6.07,"Not Listed","FACW","Native",3,4,38093,1,null,1]
["Melia azedarach",null,null,null,null,null,{"$f":"SUM(COUNTIFS(C667:F667,{\"P\",\"C\",\"D\"}))","v":0},0,0,"Category 2",null,"Exotic",2,1,29024,2,6,2]
["Melinis",null,null,null,null,null,{"$f":"SUM(COUNTIFS(C668:F668,{\"P\",\"C\",\"D\"}))","v":0},0,0,"Category 2","OBL","Exotic",2,8,41862,2,2,1]
["Melinis repens","Rhynchelytrum repens",null,null,null,null,{"$f":"SUM(COUNTIFS(C669:F669,{\"P\",\"C\",\"D\"}))","v":0},0,0,"Category 1",null,"Exotic",1,1,10009314,2,2,1]
["Melochia",null,null,null,null,null,{"$f":"SUM(COUNTIFS(C670:F670,{\"P\",\"C\",\"D\"}))","v":0},0,null,-9,null,-9,-9,-9,21547,-9,-9,-9]
["Melochia corchorifolia",null,null,null,null,null,{"$f":"SUM(COUNTIFS(C671:F671,{\"P\",\"C\",\"D\"}))","v":0},0,2.2400000000000002,"Not Listed","FAC","Exotic",3,3,21549,2,5,3]
["Melothria pendula",null,null,null,null,null,{"$f":"SUM(COUNTIFS(C672:F672,{\"P\",\"C\",\"D\"}))","v":0},0,3.31,"Not Listed",null,"Native",3,-9,22339,1,null,1]
["Micranthemum",null,null,null,null,null,{"$f":"SUM(COUNTIFS(C673:F673,{\"P\",\"C\",\"D\"}))","v":0},0,5.75,"Not Listed","OBL","Native",3,5,33228,1,1,1]
["Micranthemum glomeratum",null,null,null,null,null,{"$f":"SUM(COUNTIFS(C674:F674,{\"P\",\"C\",\"D\"}))","v":0},0,5.85,"Not Listed","OBL","Native",3,5,33230,1,1,1]
["Micranthemum umbrosum",null,null,null,null,null,{"$f":"SUM(COUNTIFS(C675:F675,{\"P\",\"C\",\"D\"}))","v":0},0,5.66,"Not Listed","OBL","Native",3,5,33231,1,1,1]
["Micromeria brownei",null,null,null,null,null,{"$f":"SUM(COUNTIFS(C676:F676,{\"P\",\"C\",\"D\"}))","v":0},0,6.34,"Not Listed","OBL","Native",3,5,10007714,1,null,1]
["Mikania",null,null,null,null,null,{"$f":"SUM(COUNTIFS(C677:F677,{\"P\",\"C\",\"D\"}))","v":0},0,null,-9,null,-9,-9,-9,36042,-9,-9,-9]
["Mikania scandens",null,null,null,null,null,{"$f":"SUM(COUNTIFS(C678:F678,{\"P\",\"C\",\"D\"}))","v":0},0,1.95,"Not Listed",null,"Native",3,1,36043,1,7,1]
["Mimosa",null,null,null,null,null,{"$f":"SUM(COUNTIFS(C679:F679,{\"P\",\"C\",\"D\"}))","v":0},0,null,-9,null,-9,-9,-9,26781,-9,-9,-9]
["Mimosa pigra",null,null,null,null,null,{"$f":"SUM(COUNTIFS(C680:F680,{\"P\",\"C\",\"D\"}))","v":0},0,0,"Category 1","FAC","Exotic",1,3,26789,2,6,2]
["Mitchella repens",null,null,null,null,null,{"$f":"SUM(COUNTIFS(C681:F681,{\"P\",\"C\",\"D\"}))","v":0},0,7.37,"Not Listed",null,"Native",3,-9,35063,1,null,1]
["Mitreola",null,null,null,null,null,{"$f":"SUM(COUNTIFS(C682:F682,{\"P\",\"C\",\"D\"}))","v":0},0,-9,"Not Listed","FACW",-9,3,4,10007715,-9,1,1]
["Mitreola petiolata",null,null,null,null,null,{"$f":"SUM(COUNTIFS(C683:F683,{\"P\",\"C\",\"D\"}))","v":0},0,5.41,"Not Listed","FACW","Native",3,4,10007716,1,1,1]
["Mitreola sessilifolia",null,null,null,null,null,{"$f":"SUM(COUNTIFS(C684:F684,{\"P\",\"C\",\"D\"}))","v":0},0,3.33,"Not Listed","FACW","Native",3,4,10015502,1,1,1]
["Mollugo verticillata",null,null,null,null,null,{"$f":"SUM(COUNTIFS(C685:F685,{\"P\",\"C\",\"D\"}))","v":0},0,1.3,"Not Listed",null,"Exotic",3,-9,19899,2,null,1]
["Momordica",null,null,null,null,null,{"$f":"SUM(COUNTIFS(C686:F686,{\"P\",\"C\",\"D\"}))","v":0},0,null,-9,"UPL","Exotic",-9,2,22397,2,7,1]
["Momordica charantia",null,null,null,null,null,{"$f":"SUM(COUNTIFS(C687:F687,{\"P\",\"C\",\"D\"}))","v":0},0,null,"Not Listed","UPL","Exotic",3,2,10015737,2,7,1]
["Morinda royoc",null,null,null,null,null,{"$f":"SUM(COUNTIFS(C688:F688,{\"P\",\"C\",\"D\"}))","v":0},0,2.88,"Not Listed","FACW","Native",3,4,35072,1,7,2]
["Muhlenbergia",null,null,null,null,null,{"$f":"SUM(COUNTIFS(C689:F689,{\"P\",\"C\",\"D\"}))","v":0},0,null,-9,null,-9,-9,-9,41883,-9,-9,-9]
["Muhlenbergia capillaris",null,null,null,null,null,{"$f":"SUM(COUNTIFS(C690:F690,{\"P\",\"C\",\"D\"}))","v":0},0,5.43,"Not Listed","OBL","Native",3,5,41902,1,2,1]
["Murdannia",null,null,null,null,null,{"$f":"SUM(COUNTIFS(C691:F691,{\"P\",\"C\",\"D\"}))","v":0},0,null,-9,null,-9,-9,-9,39144,-9,-9,-9]
["Murdannia keisak",null,null,null,null,null,{"$f":"SUM(COUNTIFS(C692:F692,{\"P\",\"C\",\"D\"}))","v":0},0,2.34,"Not Listed","FAC","Exotic",3,3,39145,2,null,1]
["Murdannia nudiflora",null,null,null,null,null,{"$f":"SUM(COUNTIFS(C693:F693,{\"P\",\"C\",\"D\"}))","v":0},0,1.42,"Not Listed","FAC","Exotic",3,3,39146,2,1,1]
["Musa",null,null,null,null,null,{"$f":"SUM(COUNTIFS(C694:F694,{\"P\",\"C\",\"D\"}))","v":0},0,-9,"Not Listed",null,"Exotic",3,1,42388,2,6,2]
["Musa sapientum",null,null,null,null,null,{"$f":"SUM(COUNTIFS(C695:F695,{\"P\",\"C\",\"D\"}))","v":0},0,0,"Not Listed","UPL","Exotic",3,2,10008852,2,6,2]
["Musa sapientum paradisiaca",null,null,null,null,null,{"$f":"SUM(COUNTIFS(C696:F696,{\"P\",\"C\",\"D\"}))","v":0},0,0,"Not Listed","UPL","Exotic",3,2,10009271,2,6,2]
["Myrica",null,null,null,null,null,{"$f":"SUM(COUNTIFS(C697:F697,{\"P\",\"C\",\"D\"}))","v":0},0,-9,"Not Listed","Var Genus",-9,3,9,19260,-9,4,2]
["Myrica caroliniensis","Myrica heterophylla",null,null,null,null,{"$f":"SUM(COUNTIFS(C698:F698,{\"P\",\"C\",\"D\"}))","v":0},0,4.33,"Not Listed","FACW","Native",3,4,10014912,1,4,2]
["Myrica cerifera",null,"P","P","P","P",{"$f":"SUM(COUNTIFS(C699:F699,{\"P\",\"C\",\"D\"}))","v":4},4,2,"Not Listed","FAC","Native",3,3,19261,1,4,2]
["Myriophyllum (native)",null,null,null,null,null,{"$f":"SUM(COUNTIFS(C700:F700,{\"P\",\"C\",\"D\"}))","v":0},0,4.7699999999999996,"Not Listed","OBL","Native",3,5,10015740,1,null,1]
["Myriophyllum (unknown nativity)",null,null,null,null,null,{"$f":"SUM(COUNTIFS(C701:F701,{\"P\",\"C\",\"D\"}))","v":0},0,-9,"Split Genus","OBL",-9,4,5,27034,-9,1,1]
["Myriophyllum aquaticum",null,null,null,null,null,{"$f":"SUM(COUNTIFS(C702:F702,{\"P\",\"C\",\"D\"}))","v":0},0,0.98,"Not Listed","OBL","Exotic",3,5,10007685,2,1,1]
["Myriophyllum heterophyllum",null,null,null,null,null,{"$f":"SUM(COUNTIFS(C703:F703,{\"P\",\"C\",\"D\"}))","v":0},0,4.7699999999999996,"Not Listed","OBL","Native",3,5,27044,1,1,1]
["Myriophyllum laxum",null,null,null,null,null,{"$f":"SUM(COUNTIFS(C704:F704,{\"P\",\"C\",\"D\"}))","v":0},0,7.5,"Not Listed","OBL","Native",3,5,27046,1,1,1]
["Myriophyllum pinnatum",null,null,null,null,null,{"$f":"SUM(COUNTIFS(C705:F705,{\"P\",\"C\",\"D\"}))","v":0},0,5.85,"Not Listed","OBL","Native",3,5,27038,1,1,1]
["Myriophyllum spicatum",null,null,null,null,null,{"$f":"SUM(COUNTIFS(C706:F706,{\"P\",\"C\",\"D\"}))","v":0},0,0,"Category 2","OBL","Exotic",2,5,27039,2,1,1]
["Najas",null,null,null,null,null,{"$f":"SUM(COUNTIFS(C707:F707,{\"P\",\"C\",\"D\"}))","v":0},0,-9,"Not Listed","OBL",-9,3,5,38995,-9,1,1]
["Najas filifolia",null,null,null,null,null,{"$f":"SUM(COUNTIFS(C708:F708,{\"P\",\"C\",\"D\"}))","v":0},0,8.4499999999999993,"Not Listed","OBL","Native",3,5,10007686,1,1,1]
["Najas gracillima",null,null,null,null,null,{"$f":"SUM(COUNTIFS(C709:F709,{\"P\",\"C\",\"D\"}))","v":0},0,3,"Not Listed","OBL","Native",3,5,38997,1,1,1]
["Najas guadalupensis",null,null,null,null,null,{"$f":"SUM(COUNTIFS(C710:F710,{\"P\",\"C\",\"D\"}))","v":0},0,5.07,"Not Listed","OBL","Native",3,5,38998,1,1,1]
["Najas marina",null,null,null,null,null,{"$f":"SUM(COUNTIFS(C711:F711,{\"P\",\"C\",\"D\"}))","v":0},0,7.15,"Not Listed","OBL","Native",3,5,39001,1,1,1]
["Najas minor",null,null,null,null,null,{"$f":"SUM(COUNTIFS(C712:F712,{\"P\",\"C\",\"D\"}))","v":0},0,6,"Not Listed","OBL","Exotic",3,5,39002,2,1,1]
["Nasturtium",null,null,null,null,null,{"$f":"SUM(COUNTIFS(C713:F713,{\"P\",\"C\",\"D\"}))","v":0},0,null,"Not Listed","OBL",-9,3,5,23252,-9,1,1]
["Nasturtium floridanum",null,null,null,null,null,{"$f":"SUM(COUNTIFS(C714:F714,{\"P\",\"C\",\"D\"}))","v":0},0,-9,"Not Listed","OBL","Native",3,5,10015763,1,1,1]
["Nasturtium officinale",null,null,null,null,null,{"$f":"SUM(COUNTIFS(C715:F715,{\"P\",\"C\",\"D\"}))","v":0},0,2.93,"Not Listed","OBL","Exotic",3,5,23255,2,1,1]
["Nelumbo",null,null,null,null,null,{"$f":"SUM(COUNTIFS(C716:F716,{\"P\",\"C\",\"D\"}))","v":0},0,-9,"Not Listed","OBL",-9,3,5,18397,-9,1,1]
["Nelumbo lutea",null,null,null,null,null,{"$f":"SUM(COUNTIFS(C717:F717,{\"P\",\"C\",\"D\"}))","v":0},0,5.5,"Not Listed","OBL","Native",3,5,18398,1,1,1]
["Nephrolepis",null,null,null,null,null,{"$f":"SUM(COUNTIFS(C718:F718,{\"P\",\"C\",\"D\"}))","v":0},0,-9,"Split Genus","FAC",-9,4,3,17601,-9,1,1]
["Nephrolepis cordifolia",null,null,null,null,null,{"$f":"SUM(COUNTIFS(C719:F719,{\"P\",\"C\",\"D\"}))","v":0},0,0,"Category 1","FACW","Exotic",1,4,17604,2,1,1]
["Nephrolepis exaltata",null,null,null,null,null,{"$f":"SUM(COUNTIFS(C720:F720,{\"P\",\"C\",\"D\"}))","v":0},{"$f":"IF(OR(N720=3,N720=4,N720=5,N720=8,N720=9,Q720=7,O720=18036),G720,0)","v":0},3,"Not Listed","FAC","Native",3,3,17605,1,1,1]
["Nerium",null,null,null,null,null,{"$f":"SUM(COUNTIFS(C721:F721,{\"P\",\"C\",\"D\"}))","v":0},0,null,-9,"UPL","Exotic",-9,2,30183,2,4,2]
["Neyraudia reynaudiana",null,null,null,null,null,{"$f":"SUM(COUNTIFS(C722:F722,{\"P\",\"C\",\"D\"}))","v":0},0,0,"Category 1","FAC","Exotic",1,3,41961,2,1,1]
["Nitella",null,null,null,null,null,{"$f":"SUM(COUNTIFS(C723:F723,{\"P\",\"C\",\"D\"}))","v":0},0,6,"Not Listed","OBL","Native",3,5,9467,1,3,1]
["Nuphar",null,null,null,null,null,{"$f":"SUM(COUNTIFS(C724:F724,{\"P\",\"C\",\"D\"}))","v":0},0,3.5,"Not Listed","OBL","Native",3,5,18371,1,1,1]
["Nuphar luteum","Nuphar advena",null,null,null,null,{"$f":"SUM(COUNTIFS(C725:F725,{\"P\",\"C\",\"D\"}))","v":0},0,3.5,"Not Listed","OBL","Native",3,5,18372,1,1,1]
["Nymphaea",null,null,null,null,null,{"$f":"SUM(COUNTIFS(C726:F726,{\"P\",\"C\",\"D\"}))","v":0},0,-9,"Not Listed","OBL","Native",3,5,18383,1,1,1]
["Nymphaea capensis zanzibariensis",null,null,null,null,null,{"$f":"SUM(COUNTIFS(C727:F727,{\"P\",\"C\",\"D\"}))","v":0},0,0,-9,"OBL","Exotic",-9,5,10015865,2,1,1]
["Nymphaea lotus",null,null,null,null,null,{"$f":"SUM(COUNTIFS(C728:F728,{\"P\",\"C\",\"D\"}))","v":0},0,null,"Not Listed","OBL","Exotic",3,5,10015822,2,1,1]
["Nymphaea mexicana",null,null,null,null,null,{"$f":"SUM(COUNTIFS(C729:F729,{\"P\",\"C\",\"D\"}))","v":0},0,6.5,"Not Listed","OBL","Native",3,5,18385,1,1,1]
["Nymphaea odorata",null,null,null,null,null,{"$f":"SUM(COUNTIFS(C730:F730,{\"P\",\"C\",\"D\"}))","v":0},0,5,"Not Listed","OBL","Native",3,5,18384,1,1,1]
["Nymphoides (native)",null,null,null,null,null,{"$f":"SUM(COUNTIFS(C731:F731,{\"P\",\"C\",\"D\"}))","v":0},0,-9,"Not Listed","OBL","Native",3,5,10015741,1,1,1]
["Nymphoides (unknown nativity)",null,null,null,null,null,{"$f":"SUM(COUNTIFS(C732:F732,{\"P\",\"C\",\"D\"}))","v":0},0,-9,"Split Genus","OBL",-9,4,5,29995,-9,1,1]
["Nymphoides aquatica",null,null,null,null,null,{"$f":"SUM(COUNTIFS(C733:F733,{\"P\",\"C\",\"D\"}))","v":0},0,6.09,"Not Listed","OBL","Native",3,5,29996,1,1,1]
["Nymphoides cordata",null,null,null,null,null,{"$f":"SUM(COUNTIFS(C734:F734,{\"P\",\"C\",\"D\"}))","v":0},0,-9,"Not Listed","OBL","Native",3,5,29997,1,1,1]
["Nymphoides cristata",null,null,null,null,null,{"$f":"SUM(COUNTIFS(C735:F735,{\"P\",\"C\",\"D\"}))","v":0},0,0,"Category 1","OBL","Exotic",1,5,10015625,2,1,1]
["Nymphoides indica",null,null,null,null,null,{"$f":"SUM(COUNTIFS(C736:F736,{\"P\",\"C\",\"D\"}))","v":0},0,0,"Not Listed","OBL","Exotic",3,5,10015990,2,1,1]
["Nyssa",null,null,null,null,null,{"$f":"SUM(COUNTIFS(C737:F737,{\"P\",\"C\",\"D\"}))","v":0},0,-9,"Not Listed","OBL","Native",3,5,27820,1,6,2]
["Nyssa aquatica",null,null,null,null,null,{"$f":"SUM(COUNTIFS(C738:F738,{\"P\",\"C\",\"D\"}))","v":0},0,-9,"Not Listed","OBL","Native",3,5,27824,1,6,2]
["Nyssa ogeche",null,null,null,null,null,{"$f":"SUM(COUNTIFS(C739:F739,{\"P\",\"C\",\"D\"}))","v":0},0,7,"Not Listed","OBL","Native",3,5,10015469,1,6,2]
["Nyssa sylvatica",null,null,null,null,null,{"$f":"SUM(COUNTIFS(C740:F740,{\"P\",\"C\",\"D\"}))","v":0},0,null,-9,null,-9,-9,-9,27821,-9,-9,-9]
["Nyssa sylvatica biflora",null,"P","P","P","",{"$f":"SUM(COUNTIFS(C741:F741,{\"P\",\"C\",\"D\"}))","v":3},3,7,"Not Listed","OBL","Native",3,5,27823,1,6,2]
["Oldenlandia",null,null,null,null,null,{"$f":"SUM(COUNTIFS(C742:F742,{\"P\",\"C\",\"D\"}))","v":0},0,-9,"Not Listed","FACW",-9,3,4,35075,-9,1,1]
["Oldenlandia uniflora","Hedyotis uniflora",null,null,null,null,{"$f":"SUM(COUNTIFS(C743:F743,{\"P\",\"C\",\"D\"}))","v":0},0,2.5,"Not Listed","FACW","Native",3,4,35082,1,1,1]
["Orontium aquaticum",null,null,null,null,null,{"$f":"SUM(COUNTIFS(C744:F744,{\"P\",\"C\",\"D\"}))","v":0},0,8.39,"Not Listed","OBL","Native",3,5,42532,1,1,1]
["Osmunda",null,null,null,null,null,{"$f":"SUM(COUNTIFS(C745:F745,{\"P\",\"C\",\"D\"}))","v":0},0,-9,"Not Listed","Var Genus",-9,3,9,17217,-9,1,1]
["Osmunda cinnamomea",null,null,null,null,null,{"$f":"SUM(COUNTIFS(C746:F746,{\"P\",\"C\",\"D\"}))","v":0},0,6.44,"Not Listed","FACW","Native",3,4,17219,1,1,1]
["Osmunda regalis",null,"","P","","P",{"$f":"SUM(COUNTIFS(C747:F747,{\"P\",\"C\",\"D\"}))","v":2},2,7.6,"Not Listed","OBL","Native",3,5,17218,1,1,1]
["Ostrya virginiana","Ostrya virginica",null,null,null,null,{"$f":"SUM(COUNTIFS(C748:F748,{\"P\",\"C\",\"D\"}))","v":0},0,5.91,"Not Listed","UPL","Native",3,2,10009053,1,6,2]
["Ottelia alismoides",null,null,null,null,null,{"$f":"SUM(COUNTIFS(C749:F749,{\"P\",\"C\",\"D\"}))","v":0},0,null,"Not Listed","OBL","Exotic",3,8,38976,2,1,1]
["Oxalis corniculata",null,null,null,null,null,{"$f":"SUM(COUNTIFS(C750:F750,{\"P\",\"C\",\"D\"}))","v":0},0,1.37,"Not Listed",null,"Native",3,-9,29067,1,null,1]
["Oxycaryum cubense","Scirpus cubensis",null,null,null,null,{"$f":"SUM(COUNTIFS(C751:F751,{\"P\",\"C\",\"D\"}))","v":0},0,0,"Not Listed","OBL","Exotic",3,5,10015467,2,null,1]
["Oxypolis",null,null,null,null,null,{"$f":"SUM(COUNTIFS(C752:F752,{\"P\",\"C\",\"D\"}))","v":0},0,null,-9,null,-9,-9,-9,29543,-9,-9,-9]
["Oxypolis filiformis",null,null,null,null,null,{"$f":"SUM(COUNTIFS(C753:F753,{\"P\",\"C\",\"D\"}))","v":0},0,8.69,"Not Listed","OBL","Native",3,5,29547,1,1,1]
["Packera",null,null,null,null,null,{"$f":"SUM(COUNTIFS(C754:F754,{\"P\",\"C\",\"D\"}))","v":0},0,-9,"Not Listed",null,"Native",3,1,10015422,1,1,1]
["Packera glabella","Senecio glabellus",null,null,null,null,{"$f":"SUM(COUNTIFS(C755:F755,{\"P\",\"C\",\"D\"}))","v":0},0,2.33,"Not Listed","OBL","Native",3,5,10015421,1,1,1]
["Pandanus veitchii",null,null,null,null,null,{"$f":"SUM(COUNTIFS(C756:F756,{\"P\",\"C\",\"D\"}))","v":0},0,-9,"Not Listed",null,"Exotic",3,1,10015343,2,6,2]
["Panicum",null,null,null,null,null,{"$f":"SUM(COUNTIFS(C757:F757,{\"P\",\"C\",\"D\"}))","v":0},0,-9,"Split Genus","Var Genus",-9,4,9,40901,-9,2,1]
["Panicum abscissum",null,null,null,null,null,{"$f":"SUM(COUNTIFS(C758:F758,{\"P\",\"C\",\"D\"}))","v":0},0,9.2200000000000006,"Not Listed","FACW","Native",3,4,40926,1,2,1]
["Panicum anceps",null,null,null,null,null,{"$f":"SUM(COUNTIFS(C759:F759,{\"P\",\"C\",\"D\"}))","v":0},0,4.6100000000000003,"Not Listed","FAC","Native",3,3,40904,1,2,1]
["Panicum dichotomiflorum",null,null,null,null,null,{"$f":"SUM(COUNTIFS(C760:F760,{\"P\",\"C\",\"D\"}))","v":0},0,4.96,"Not Listed","FACW","Native",3,4,40908,1,2,1]
["Panicum dichotomum",null,null,null,null,null,{"$f":"SUM(COUNTIFS(C761:F761,{\"P\",\"C\",\"D\"}))","v":0},0,5.61,"Not Listed","FACW","Native",3,4,10007688,1,null,1]
["Panicum ensifolium",null,null,null,null,null,{"$f":"SUM(COUNTIFS(C762:F762,{\"P\",\"C\",\"D\"}))","v":0},0,6.5,"Not Listed","OBL","Native",3,5,10007689,1,null,1]
["Panicum hemitomon",null,"P","","P","P",{"$f":"SUM(COUNTIFS(C763:F763,{\"P\",\"C\",\"D\"}))","v":3},3,5.82,"Not Listed","OBL","Native",3,5,40909,1,2,1]
["Panicum hians","Steinchisma hians",null,null,null,null,{"$f":"SUM(COUNTIFS(C764:F764,{\"P\",\"C\",\"D\"}))","v":0},0,6.63,"Not Listed","FAC","Native",3,3,10007691,1,null,1]
["Panicum maximum",null,null,null,null,null,{"$f":"SUM(COUNTIFS(C765:F765,{\"P\",\"C\",\"D\"}))","v":0},0,0,"Category 2",null,"Exotic",2,1,40945,2,2,1]
["Panicum repens",null,null,null,null,null,{"$f":"SUM(COUNTIFS(C766:F766,{\"P\",\"C\",\"D\"}))","v":0},0,0,"Category 1","FACW","Exotic",1,4,10007692,2,2,1]
["Panicum rigidulum",null,null,null,null,null,{"$f":"SUM(COUNTIFS(C767:F767,{\"P\",\"C\",\"D\"}))","v":0},0,5.47,"Not Listed","FACW","Native",3,4,40956,1,2,1]
["Panicum rigidulum pubescens","Panicum longifolium",null,null,null,null,{"$f":"SUM(COUNTIFS(C768:F768,{\"P\",\"C\",\"D\"}))","v":0},0,5.47,"Not Listed","FACW","Native",3,4,10009315,1,null,1]
["Panicum scabriusculum","Dichanthelium scabriusculum",null,null,null,null,{"$f":"SUM(COUNTIFS(C769:F769,{\"P\",\"C\",\"D\"}))","v":0},0,5.5,"Not Listed","OBL","Native",3,5,10007693,1,null,1]
["Panicum spretum",null,null,null,null,null,{"$f":"SUM(COUNTIFS(C770:F770,{\"P\",\"C\",\"D\"}))","v":0},0,6.63,"Not Listed","FACW","Native",3,4,10007694,1,null,1]
["Panicum tenerum",null,null,null,null,null,{"$f":"SUM(COUNTIFS(C771:F771,{\"P\",\"C\",\"D\"}))","v":0},0,8.67,"Not Listed","OBL","Native",3,5,40958,1,2,1]
["Panicum verrucosum",null,null,null,null,null,{"$f":"SUM(COUNTIFS(C772:F772,{\"P\",\"C\",\"D\"}))","v":0},0,6.83,"Not Listed","FACW","Native",3,4,40961,1,2,1]
["Panicum virgatum",null,null,null,null,null,{"$f":"SUM(COUNTIFS(C773:F773,{\"P\",\"C\",\"D\"}))","v":0},0,5.44,"Not Listed","FACW","Native",3,4,40913,1,2,1]
["Parietaria",null,null,null,null,null,{"$f":"SUM(COUNTIFS(C774:F774,{\"P\",\"C\",\"D\"}))","v":0},0,null,-9,null,-9,-9,-9,19164,-9,-9,-9]
["Parietaria floridana",null,null,null,null,null,{"$f":"SUM(COUNTIFS(C775:F775,{\"P\",\"C\",\"D\"}))","v":0},0,null,"Not Listed","FAC","Native",3,3,19165,1,1,1]
["Parthenocissus quinquefolia",null,null,null,null,null,{"$f":"SUM(COUNTIFS(C776:F776,{\"P\",\"C\",\"D\"}))","v":0},0,3.43,"Not Listed",null,"Native",3,1,28602,1,7,1]
["Paspalidium",null,null,null,null,null,{"$f":"SUM(COUNTIFS(C777:F777,{\"P\",\"C\",\"D\"}))","v":0},0,null,-9,null,-9,-9,-9,41996,-9,-9,-9]
["Paspalidium geminatum",null,null,null,null,null,{"$f":"SUM(COUNTIFS(C778:F778,{\"P\",\"C\",\"D\"}))","v":0},0,5.5,"Not Listed","OBL","Native",3,5,41997,1,2,1]
["Paspalum",null,null,null,null,null,{"$f":"SUM(COUNTIFS(C779:F779,{\"P\",\"C\",\"D\"}))","v":0},0,-9,"Not Listed","Var Genus",-9,3,9,40990,-9,2,1]
["Paspalum acuminatum",null,null,null,null,null,{"$f":"SUM(COUNTIFS(C780:F780,{\"P\",\"C\",\"D\"}))","v":0},0,1.06,"Not Listed","FACW","Exotic",3,4,40995,2,null,1]
["Paspalum conjugatum",null,null,null,null,null,{"$f":"SUM(COUNTIFS(C781:F781,{\"P\",\"C\",\"D\"}))","v":0},0,3.84,"Not Listed","FAC","Exotic",3,3,41015,2,2,1]
["Paspalum dilatatum",null,null,null,null,null,{"$f":"SUM(COUNTIFS(C782:F782,{\"P\",\"C\",\"D\"}))","v":0},0,4.33,"Not Listed","FAC","Exotic",3,3,40997,2,2,1]
["Paspalum distichum",null,null,null,null,null,{"$f":"SUM(COUNTIFS(C783:F783,{\"P\",\"C\",\"D\"}))","v":0},0,5.54,"Not Listed","OBL","Native",3,5,41005,1,2,1]
["Paspalum floridanum",null,null,null,null,null,{"$f":"SUM(COUNTIFS(C784:F784,{\"P\",\"C\",\"D\"}))","v":0},{"$f":"IF(OR(N784=3,N784=4,N784=5,N784=8,N784=9,Q784=7,O784=18036),G784,0)","v":0},6.11,"Not Listed","FACW","Native",3,4,40992,1,2,1]
["Paspalum laeve",null,null,null,null,null,{"$f":"SUM(COUNTIFS(C785:F785,{\"P\",\"C\",\"D\"}))","v":0},0,5.79,"Not Listed","FACW","Native",3,4,41024,1,2,1]
["Paspalum monostachyum",null,null,null,null,null,{"$f":"SUM(COUNTIFS(C786:F786,{\"P\",\"C\",\"D\"}))","v":0},0,9.8000000000000007,"Not Listed","OBL","Native",3,5,41030,1,null,1]
["Paspalum notatum",null,null,null,null,null,{"$f":"SUM(COUNTIFS(C787:F787,{\"P\",\"C\",\"D\"}))","v":0},0,0.14000000000000001,"Not Listed",null,"Exotic",3,1,41000,2,2,1]
["Paspalum praecox",null,null,null,null,null,{"$f":"SUM(COUNTIFS(C788:F788,{\"P\",\"C\",\"D\"}))","v":0},0,6.5,"Not Listed","OBL","Native",3,5,41036,1,2,1]
["Paspalum repens",null,null,null,null,null,{"$f":"SUM(COUNTIFS(C789:F789,{\"P\",\"C\",\"D\"}))","v":0},0,5.6,"Not Listed","OBL","Native",3,5,41039,1,2,1]
["Paspalum setaceum",null,null,null,null,null,{"$f":"SUM(COUNTIFS(C790:F790,{\"P\",\"C\",\"D\"}))","v":0},0,3.44,"Not Listed","FAC","Native",3,3,41042,1,2,1]
["Paspalum urvillei",null,null,null,null,null,{"$f":"SUM(COUNTIFS(C791:F791,{\"P\",\"C\",\"D\"}))","v":0},0,0,"Not Listed","FAC","Exotic",3,3,41043,2,2,1]
["Passiflora",null,null,null,null,null,{"$f":"SUM(COUNTIFS(C792:F792,{\"P\",\"C\",\"D\"}))","v":0},0,-9,"Split Genus",null,-9,4,1,22219,-9,7,1]
["Passiflora incarnata",null,null,null,null,null,{"$f":"SUM(COUNTIFS(C793:F793,{\"P\",\"C\",\"D\"}))","v":0},0,2.89,"Not Listed",null,"Native",3,1,10007695,1,7,1]
["Peltandra",null,null,null,null,null,{"$f":"SUM(COUNTIFS(C794:F794,{\"P\",\"C\",\"D\"}))","v":0},0,7.5,"Not Listed","OBL","Native",3,5,42533,1,1,1]
["Peltandra sagittifolia",null,null,null,null,null,{"$f":"SUM(COUNTIFS(C795:F795,{\"P\",\"C\",\"D\"}))","v":0},0,7.5,"Not Listed","OBL","Native",3,5,42536,1,1,1]
["Peltandra virginica",null,null,null,null,null,{"$f":"SUM(COUNTIFS(C796:F796,{\"P\",\"C\",\"D\"}))","v":0},0,7.5,"Not Listed","OBL","Native",3,5,42534,1,1,1]
["Pennisetum",null,null,null,null,null,{"$f":"SUM(COUNTIFS(C797:F797,{\"P\",\"C\",\"D\"}))","v":0},0,2.79,"Split Genus","FAC","Exotic",4,3,42000,2,2,1]
["Pennisetum purpureum",null,null,null,null,null,{"$f":"SUM(COUNTIFS(C798:F798,{\"P\",\"C\",\"D\"}))","v":0},0,0,"Category 1","FAC","Exotic",1,3,42004,2,2,1]
["Persea",null,null,null,null,null,{"$f":"SUM(COUNTIFS(C799:F799,{\"P\",\"C\",\"D\"}))","v":0},0,-9,-9,"Var Genus","Native",-9,9,18148,1,5,2]
["Persea borbonia",null,null,null,null,null,{"$f":"SUM(COUNTIFS(C800:F800,{\"P\",\"C\",\"D\"}))","v":0},0,8.02,"Not Listed",null,"Native",3,1,18149,1,6,2]
["Persea borbonia humilis",null,null,null,null,null,{"$f":"SUM(COUNTIFS(C801:F801,{\"P\",\"C\",\"D\"}))","v":0},0,7.43,"Not Listed",null,"Native",3,1,18151,1,4,2]
["Persea palustris",null,null,null,null,null,{"$f":"SUM(COUNTIFS(C802:F802,{\"P\",\"C\",\"D\"}))","v":0},0,7,"Not Listed","OBL","Native",3,5,10007743,1,6,2]
["Persicaria","Polygonum",null,null,null,null,{"$f":"SUM(COUNTIFS(C803:F803,{\"P\",\"C\",\"D\"}))","v":0},0,-9,"Not Listed","Var Genus",null,3,9,10016067,null,1,1]
["Persicaria glabra",null,null,null,null,null,{"$f":"SUM(COUNTIFS(C804:F804,{\"P\",\"C\",\"D\"}))","v":0},0,4.5,"Not Listed","OBL","Native",3,5,10016068,1,1,1]
["Persicaria hirsuta","Polygonum densiflorum, Polygonum glabrum, Polygonum hirsutum",null,null,null,null,{"$f":"SUM(COUNTIFS(C805:F805,{\"P\",\"C\",\"D\"}))","v":0},0,3,"Not Listed","OBL","Native",3,5,10016069,1,1,1]
["Persicaria hydropiperoides","Polygonum hydropiperoides",null,null,null,null,{"$f":"SUM(COUNTIFS(C806:F806,{\"P\",\"C\",\"D\"}))","v":0},0,2.5,"Not Listed","OBL","Native",3,5,10016070,1,1,1]
["Persicaria lapathifolia","Polygonum lapathifolium",null,null,null,null,{"$f":"SUM(COUNTIFS(C807:F807,{\"P\",\"C\",\"D\"}))","v":0},0,1.95,"Not Listed","OBL","Native",3,5,10016071,1,1,1]
["Persicaria meisneriana","Polygonum meisnerianum",null,null,null,null,{"$f":"SUM(COUNTIFS(C808:F808,{\"P\",\"C\",\"D\"}))","v":0},0,3,"Not Listed","OBL","Native",3,5,10016072,1,1,1]
["Persicaria meisneriana beyrichiana","Polygonum meisnerianum",null,null,null,null,{"$f":"SUM(COUNTIFS(C809:F809,{\"P\",\"C\",\"D\"}))","v":0},0,3,"Not Listed","OBL","Native",3,5,10016085,1,null,1]
["Persicaria pensylvanica","Polygonum pensylvanicum",null,null,null,null,{"$f":"SUM(COUNTIFS(C810:F810,{\"P\",\"C\",\"D\"}))","v":0},0,2.13,"Not Listed","OBL","Native",3,5,10016073,1,1,1]
["Persicaria punctata","Polygonum punctatum","P","P","P","P",{"$f":"SUM(COUNTIFS(C811:F811,{\"P\",\"C\",\"D\"}))","v":4},4,3,"Not Listed","OBL","Native",3,5,10016074,1,1,1]
["Persicaria setacea","Polygonum setaceum",null,null,null,null,{"$f":"SUM(COUNTIFS(C812:F812,{\"P\",\"C\",\"D\"}))","v":0},0,2.81,"Not Listed","OBL","Native",3,5,10016075,1,1,1]
["Persicaria virginiana","Polygonum virginianum",null,null,null,null,{"$f":"SUM(COUNTIFS(C813:F813,{\"P\",\"C\",\"D\"}))","v":0},0,2.75,"Not Listed","FACW","Native",3,4,10016076,1,1,1]
["Phanopyrum gymnocarpon",null,null,null,null,null,{"$f":"SUM(COUNTIFS(C814:F814,{\"P\",\"C\",\"D\"}))","v":0},0,4.25,"Not Listed","OBL","Native",3,5,42017,1,2,1]
["Phlebodium aureum",null,null,null,null,null,{"$f":"SUM(COUNTIFS(C815:F815,{\"P\",\"C\",\"D\"}))","v":0},0,6.85,"Not Listed",null,"Native",3,1,17656,1,1,1]
["Phragmites australis","Phragmites communis",null,null,null,null,{"$f":"SUM(COUNTIFS(C816:F816,{\"P\",\"C\",\"D\"}))","v":0},0,4.3899999999999997,"Not Listed","OBL","Native",3,5,41072,1,1,1]
["Phyla",null,null,null,null,null,{"$f":"SUM(COUNTIFS(C817:F817,{\"P\",\"C\",\"D\"}))","v":0},0,-9,"Not Listed","FAC",-9,3,3,32193,-9,1,1]
["Phyla nodiflora",null,null,null,null,null,{"$f":"SUM(COUNTIFS(C818:F818,{\"P\",\"C\",\"D\"}))","v":0},0,1.92,"Not Listed","FAC","Native",3,3,32197,1,1,1]
["Phyllanthus",null,null,null,null,null,{"$f":"SUM(COUNTIFS(C819:F819,{\"P\",\"C\",\"D\"}))","v":0},0,null,-9,null,-9,-9,-9,28364,-9,-9,-9]
["Phyllanthus urinaria",null,null,null,null,null,{"$f":"SUM(COUNTIFS(C820:F820,{\"P\",\"C\",\"D\"}))","v":0},0,0.22,"Not Listed","FAC","Exotic",3,3,28381,2,1,1]
["Physostegia",null,null,null,null,null,{"$f":"SUM(COUNTIFS(C821:F821,{\"P\",\"C\",\"D\"}))","v":0},0,null,-9,null,-9,-9,-9,32386,-9,-9,-9]
["Physostegia leptophylla",null,null,null,null,null,{"$f":"SUM(COUNTIFS(C822:F822,{\"P\",\"C\",\"D\"}))","v":0},0,null,"Not Listed","OBL","Native",3,5,32395,1,1,1]
["Phytolacca americana",null,null,null,null,null,{"$f":"SUM(COUNTIFS(C823:F823,{\"P\",\"C\",\"D\"}))","v":0},0,2.09,"Not Listed",null,"Native",3,1,19523,1,1,1]
["Pieris",null,null,null,null,null,{"$f":"SUM(COUNTIFS(C824:F824,{\"P\",\"C\",\"D\"}))","v":0},0,-9,"Not Listed",null,-9,3,1,23565,-9,7,3]
["Pilea",null,null,null,null,null,{"$f":"SUM(COUNTIFS(C825:F825,{\"P\",\"C\",\"D\"}))","v":0},0,-9,"Not Listed","FACW",-9,3,4,19129,-9,1,1]
["Pilea microphylla",null,null,null,null,null,{"$f":"SUM(COUNTIFS(C826:F826,{\"P\",\"C\",\"D\"}))","v":0},0,0.64,"Not Listed","FACW","Native",3,4,19133,1,1,1]
["Pilea pumila",null,null,null,null,null,{"$f":"SUM(COUNTIFS(C827:F827,{\"P\",\"C\",\"D\"}))","v":0},0,4.29,"Not Listed","FACW","Native",3,4,19130,1,1,1]
["Pinus",null,null,null,null,null,{"$f":"SUM(COUNTIFS(C828:F828,{\"P\",\"C\",\"D\"}))","v":0},0,-9,"Not Listed",null,"Native",3,-9,18035,1,6,2]
["Pinus clausa",null,null,null,null,null,{"$f":"SUM(COUNTIFS(C829:F829,{\"P\",\"C\",\"D\"}))","v":0},0,-9,"Not Listed",null,"Native",3,1,10009092,1,6,2]
["Pinus echinata",null,null,null,null,null,{"$f":"SUM(COUNTIFS(C830:F830,{\"P\",\"C\",\"D\"}))","v":0},0,2.78,"Not Listed",null,"Native",3,1,10012111,1,6,2]
["Pinus elliottii",null,"P","P","P","",{"$f":"SUM(COUNTIFS(C831:F831,{\"P\",\"C\",\"D\"}))","v":3},3,4.21,"Not Listed",null,"Native",3,1,18036,1,6,2]
["Pinus glabra",null,null,null,null,null,{"$f":"SUM(COUNTIFS(C832:F832,{\"P\",\"C\",\"D\"}))","v":0},0,5,"Not Listed","FACW","Native",3,4,10011571,1,6,2]
["Pinus palustris",null,null,null,null,null,{"$f":"SUM(COUNTIFS(C833:F833,{\"P\",\"C\",\"D\"}))","v":0},0,4.7699999999999996,"Not Listed",null,"Native",3,1,18038,1,6,2]
["Pinus taeda",null,null,null,null,null,{"$f":"SUM(COUNTIFS(C834:F834,{\"P\",\"C\",\"D\"}))","v":0},0,5.34,"Not Listed",null,"Native",3,1,18037,1,6,2]
["Pistia stratiotes",null,null,null,null,null,{"$f":"SUM(COUNTIFS(C835:F835,{\"P\",\"C\",\"D\"}))","v":0},0,0,"Category 1","OBL","Exotic",1,5,42542,2,1,1]
["Platanus occidentalis",null,null,null,null,null,{"$f":"SUM(COUNTIFS(C836:F836,{\"P\",\"C\",\"D\"}))","v":0},0,4.3600000000000003,"Not Listed","FACW","Native",3,4,19020,1,6,2]
["Pluchea",null,null,null,null,null,{"$f":"SUM(COUNTIFS(C837:F837,{\"P\",\"C\",\"D\"}))","v":0},0,-9,"Not Listed","FACW","Native",3,4,36060,1,1,1]
["Pluchea baccharis","Pluchea rosea",null,null,null,null,{"$f":"SUM(COUNTIFS(C838:F838,{\"P\",\"C\",\"D\"}))","v":0},0,5.45,"Not Listed","FACW","Native",3,4,10015606,1,1,1]
["Pluchea camphorata",null,null,null,null,null,{"$f":"SUM(COUNTIFS(C839:F839,{\"P\",\"C\",\"D\"}))","v":0},0,3,"Not Listed","FACW","Native",3,4,36061,1,1,1]
["Pluchea foetida",null,null,null,null,null,{"$f":"SUM(COUNTIFS(C840:F840,{\"P\",\"C\",\"D\"}))","v":0},0,6.65,"Not Listed","FACW","Native",3,4,36062,1,1,1]
["Pluchea longifolia",null,null,null,null,null,{"$f":"SUM(COUNTIFS(C841:F841,{\"P\",\"C\",\"D\"}))","v":0},0,5.85,"Not Listed","FACW","Native",3,4,36065,1,1,1]
["Pluchea odorata",null,null,null,null,null,{"$f":"SUM(COUNTIFS(C842:F842,{\"P\",\"C\",\"D\"}))","v":0},0,4.96,"Not Listed","FACW","Native",3,4,36066,1,1,1]
["Polygala",null,null,null,null,null,{"$f":"SUM(COUNTIFS(C843:F843,{\"P\",\"C\",\"D\"}))","v":0},0,null,-9,null,-9,-9,-9,29302,-9,-9,-9]
["Polygala cymosa",null,null,null,null,null,{"$f":"SUM(COUNTIFS(C844:F844,{\"P\",\"C\",\"D\"}))","v":0},0,7.67,"Not Listed","OBL","Native",3,5,29333,1,null,1]
["Polygala lutea",null,null,null,null,null,{"$f":"SUM(COUNTIFS(C845:F845,{\"P\",\"C\",\"D\"}))","v":0},0,null,"Not Listed","FACW","Native",3,4,29348,1,1,1]
["Polygala rugelii",null,null,null,null,null,{"$f":"SUM(COUNTIFS(C846:F846,{\"P\",\"C\",\"D\"}))","v":0},0,8.17,"Not Listed","FACW","Native",3,4,29312,1,null,1]
["Polygonella",null,null,null,null,null,{"$f":"SUM(COUNTIFS(C847:F847,{\"P\",\"C\",\"D\"}))","v":0},0,null,-9,null,-9,-9,-9,21306,-9,-9,-9]
["Polygonella gracilis",null,null,null,null,null,{"$f":"SUM(COUNTIFS(C848:F848,{\"P\",\"C\",\"D\"}))","v":0},{"$f":"IF(OR(N848=3,N848=4,N848=5,N848=8,N848=9,Q848=7,O848=18036),G848,0)","v":0},4.7699999999999996,"Not Listed",null,"Native",3,1,21311,1,1,1]
["Polypogon",null,null,null,null,null,{"$f":"SUM(COUNTIFS(C849:F849,{\"P\",\"C\",\"D\"}))","v":0},0,null,-9,null,-9,-9,-9,41170,-9,-9,-9]
["Polypogon monspeliensis",null,null,null,null,null,{"$f":"SUM(COUNTIFS(C850:F850,{\"P\",\"C\",\"D\"}))","v":0},0,1,"Not Listed","FAC","Exotic",3,3,41171,2,2,1]
["Polypremum procumbens",null,null,null,null,null,{"$f":"SUM(COUNTIFS(C851:F851,{\"P\",\"C\",\"D\"}))","v":0},0,1.71,"Not Listed","FAC","Native",3,3,29959,1,1,1]
["Pontederia",null,null,null,null,null,{"$f":"SUM(COUNTIFS(C852:F852,{\"P\",\"C\",\"D\"}))","v":0},0,null,-9,null,-9,-9,-9,42619,-9,-9,-9]
["Pontederia cordata",null,null,null,null,null,{"$f":"SUM(COUNTIFS(C853:F853,{\"P\",\"C\",\"D\"}))","v":0},0,5.38,"Not Listed","OBL","Native",3,5,42620,1,1,1]
["Pontederia rotundifolia",null,null,null,null,null,{"$f":"SUM(COUNTIFS(C854:F854,{\"P\",\"C\",\"D\"}))","v":0},0,0,"Not Listed","OBL","Exotic",3,5,10008272,2,1,1]
["Populus",null,null,null,null,null,{"$f":"SUM(COUNTIFS(C855:F855,{\"P\",\"C\",\"D\"}))","v":0},0,-9,"Not Listed",null,-9,3,1,22444,-9,6,2]
["Portulaca",null,null,null,null,null,{"$f":"SUM(COUNTIFS(C856:F856,{\"P\",\"C\",\"D\"}))","v":0},0,-9,"Not Listed",null,-9,3,1,20418,-9,1,1]
["Portulaca amilis",null,null,null,null,null,{"$f":"SUM(COUNTIFS(C857:F857,{\"P\",\"C\",\"D\"}))","v":0},0,0.87,"Not Listed",null,"Exotic",3,-9,10007696,2,null,1]
["Potamogeton",null,null,null,null,null,{"$f":"SUM(COUNTIFS(C858:F858,{\"P\",\"C\",\"D\"}))","v":0},0,-9,-9,"OBL",-9,-9,5,39005,-9,1,1]
["Potamogeton crispus",null,null,null,null,null,{"$f":"SUM(COUNTIFS(C859:F859,{\"P\",\"C\",\"D\"}))","v":0},0,1,"Not Listed","OBL","Exotic",3,5,39007,2,1,1]
["Potamogeton diversifolius",null,null,null,null,null,{"$f":"SUM(COUNTIFS(C860:F860,{\"P\",\"C\",\"D\"}))","v":0},0,6,"Not Listed","OBL","Native",3,5,39026,1,1,1]
["Potamogeton floridanus",null,null,null,null,null,{"$f":"SUM(COUNTIFS(C861:F861,{\"P\",\"C\",\"D\"}))","v":0},0,null,"Not Listed","OBL","Native",3,5,39030,1,1,1]
["Potamogeton illinoensis",null,null,null,null,null,{"$f":"SUM(COUNTIFS(C862:F862,{\"P\",\"C\",\"D\"}))","v":0},0,6.64,"Not Listed","OBL","Native",3,5,39035,1,1,1]
["Potamogeton pectinatus",null,null,null,null,null,{"$f":"SUM(COUNTIFS(C863:F863,{\"P\",\"C\",\"D\"}))","v":0},0,7.8,"Not Listed","OBL","Native",3,5,39010,1,1,1]
["Potamogeton pusillus",null,null,null,null,null,{"$f":"SUM(COUNTIFS(C864:F864,{\"P\",\"C\",\"D\"}))","v":0},0,7.8,"Not Listed","OBL","Native",3,5,39017,1,1,1]
["Proserpinaca",null,null,null,null,null,{"$f":"SUM(COUNTIFS(C865:F865,{\"P\",\"C\",\"D\"}))","v":0},0,null,-9,null,-9,-9,-9,27048,-9,-9,-9]
["Proserpinaca palustris",null,null,null,null,null,{"$f":"SUM(COUNTIFS(C866:F866,{\"P\",\"C\",\"D\"}))","v":0},0,5.85,"Not Listed","OBL","Native",3,5,27049,1,1,1]
["Proserpinaca pectinata",null,null,null,null,null,{"$f":"SUM(COUNTIFS(C867:F867,{\"P\",\"C\",\"D\"}))","v":0},0,5.5,"Not Listed","OBL","Native",3,5,27050,1,1,1]
["Prunus",null,null,null,null,null,{"$f":"SUM(COUNTIFS(C868:F868,{\"P\",\"C\",\"D\"}))","v":0},0,null,-9,null,-9,-9,-9,24762,-9,-9,-9]
["Prunus caroliniana",null,null,null,null,null,{"$f":"SUM(COUNTIFS(C869:F869,{\"P\",\"C\",\"D\"}))","v":0},0,4.03,"Not Listed",null,"Native",3,-9,24771,1,-9,2]
["Prunus serotina",null,null,null,null,null,{"$f":"SUM(COUNTIFS(C870:F870,{\"P\",\"C\",\"D\"}))","v":0},0,3.9,"Not Listed",null,"Native",3,1,24764,1,6,2]
["Psychotria",null,null,null,null,null,{"$f":"SUM(COUNTIFS(C871:F871,{\"P\",\"C\",\"D\"}))","v":0},0,-9,"Not Listed","FAC",-9,3,3,35090,-9,4,2]
["Psychotria nervosa",null,null,null,null,null,{"$f":"SUM(COUNTIFS(C872:F872,{\"P\",\"C\",\"D\"}))","v":0},0,3,"Not Listed","FAC","Native",3,3,35092,1,4,2]
["Pteridium aquilinum",null,null,null,null,null,{"$f":"SUM(COUNTIFS(C873:F873,{\"P\",\"C\",\"D\"}))","v":0},0,3.9,"Not Listed",null,"Native",3,1,17224,1,1,1]
["Pteris",null,null,null,null,null,{"$f":"SUM(COUNTIFS(C874:F874,{\"P\",\"C\",\"D\"}))","v":0},0,null,-9,null,-9,-9,-9,17699,-9,-9,-9]
["Pteris tripartita",null,null,null,null,null,{"$f":"SUM(COUNTIFS(C875:F875,{\"P\",\"C\",\"D\"}))","v":0},0,0.27,"Not Listed","FACW","Exotic",3,4,17705,2,1,1]
["Pteris vittata",null,null,null,null,null,{"$f":"SUM(COUNTIFS(C876:F876,{\"P\",\"C\",\"D\"}))","v":0},0,0,"Category 2","FACW","Exotic",2,4,17706,2,1,1]
["Ptilimnium capillaceum",null,null,null,null,null,{"$f":"SUM(COUNTIFS(C877:F877,{\"P\",\"C\",\"D\"}))","v":0},0,2.73,"Not Listed","OBL","Native",3,5,29551,1,1,1]
["Quercus",null,null,null,null,null,{"$f":"SUM(COUNTIFS(C878:F878,{\"P\",\"C\",\"D\"}))","v":0},0,-9,"Not Listed","Var Genus","Native",3,9,19276,1,6,2]
["Quercus laevis",null,null,null,null,null,{"$f":"SUM(COUNTIFS(C879:F879,{\"P\",\"C\",\"D\"}))","v":0},0,-9,"Not Listed","UPL","Native",3,2,19367,1,6,2]
["Quercus laurifolia",null,null,null,null,null,{"$f":"SUM(COUNTIFS(C880:F880,{\"P\",\"C\",\"D\"}))","v":0},0,4,"Not Listed","FACW","Native",3,4,19368,1,6,2]
["Quercus michauxii",null,null,null,null,null,{"$f":"SUM(COUNTIFS(C881:F881,{\"P\",\"C\",\"D\"}))","v":0},0,null,"Not Listed","FACW","Native",3,4,19279,1,6,2]
["Quercus nigra",null,"","P","P","",{"$f":"SUM(COUNTIFS(C882:F882,{\"P\",\"C\",\"D\"}))","v":2},2,2.5,"Not Listed","FACW","Native",3,4,19280,1,6,2]
["Quercus virginiana",null,null,null,null,null,{"$f":"SUM(COUNTIFS(C883:F883,{\"P\",\"C\",\"D\"}))","v":0},0,4.8499999999999996,"Not Listed",null,"Native",3,1,19283,1,6,2]
["Reimarochloa oligostachya",null,null,null,null,null,{"$f":"SUM(COUNTIFS(C884:F884,{\"P\",\"C\",\"D\"}))","v":0},0,1.75,"Not Listed","FACW","Native",3,4,42049,1,2,1]
["Rhexia",null,null,null,null,null,{"$f":"SUM(COUNTIFS(C885:F885,{\"P\",\"C\",\"D\"}))","v":0},0,-9,"Not Listed","Var Genus","Native",3,9,27684,1,1,1]
["Rhexia alifanus",null,null,null,null,null,{"$f":"SUM(COUNTIFS(C886:F886,{\"P\",\"C\",\"D\"}))","v":0},0,4.5999999999999996,"Not Listed","FACW","Native",3,4,27687,1,1,1]
["Rhexia cubensis",null,null,null,null,null,{"$f":"SUM(COUNTIFS(C887:F887,{\"P\",\"C\",\"D\"}))","v":0},0,7.22,"Not Listed","FACW","Native",3,4,27695,1,1,1]
["Rhexia lutea",null,null,null,null,null,{"$f":"SUM(COUNTIFS(C888:F888,{\"P\",\"C\",\"D\"}))","v":0},0,null,-9,null,-9,-9,-9,27689,-9]
["Rhexia mariana",null,null,null,null,null,{"$f":"SUM(COUNTIFS(C889:F889,{\"P\",\"C\",\"D\"}))","v":0},0,4,"Not Listed","FACW","Native",3,4,27685,1,1,1]
["Rhexia nashii",null,null,null,null,null,{"$f":"SUM(COUNTIFS(C890:F890,{\"P\",\"C\",\"D\"}))","v":0},0,7.8,"Not Listed","FACW","Native",3,4,27690,1,1,1]
["Rhexia nuttallii",null,null,null,null,null,{"$f":"SUM(COUNTIFS(C891:F891,{\"P\",\"C\",\"D\"}))","v":0},0,7.93,"Not Listed","FACW","Native",3,4,27691,1,1,1]
["Rhexia petiolata",null,null,null,null,null,{"$f":"SUM(COUNTIFS(C892:F892,{\"P\",\"C\",\"D\"}))","v":0},0,7.9,"Not Listed","FACW","Native",3,4,27693,1,1,1]
["Rhexia salicifolia",null,null,null,null,null,{"$f":"SUM(COUNTIFS(C893:F893,{\"P\",\"C\",\"D\"}))","v":0},0,7.14,"Not Listed","OBL","Native",3,5,27694,1,1,1]
["Rhexia virginica",null,null,null,null,null,{"$f":"SUM(COUNTIFS(C894:F894,{\"P\",\"C\",\"D\"}))","v":0},0,3.8,"Not Listed","FACW","Native",3,4,27686,1,1,1]
["Rhizophora mangle",null,null,null,null,null,{"$f":"SUM(COUNTIFS(C895:F895,{\"P\",\"C\",\"D\"}))","v":0},0,3,"Not Listed","OBL","Native",3,5,10013211,1,4,2]
["Rhododendron",null,null,null,null,null,{"$f":"SUM(COUNTIFS(C896:F896,{\"P\",\"C\",\"D\"}))","v":0},0,null,-9,null,-9,-9,-9,23700,-9,-9,-9]
["Rhododendron canescens",null,null,null,null,null,{"$f":"SUM(COUNTIFS(C897:F897,{\"P\",\"C\",\"D\"}))","v":0},0,-9,"Not Listed",null,"Native",3,1,23712,1,4,2]
["Rhododendron viscosum",null,null,null,null,null,{"$f":"SUM(COUNTIFS(C898:F898,{\"P\",\"C\",\"D\"}))","v":0},0,5.33,"Not Listed","FACW","Native",3,4,23731,1,4,2]
["Rhodomyrtus tomentosa",null,null,null,null,null,{"$f":"SUM(COUNTIFS(C899:F899,{\"P\",\"C\",\"D\"}))","v":0},0,0,"Category 1","FAC","Exotic",1,3,27245,2,4,2]
["Rhus",null,null,null,null,null,{"$f":"SUM(COUNTIFS(C900:F900,{\"P\",\"C\",\"D\"}))","v":0},0,-9,"Not Listed",null,-9,3,1,28772,-9,4,2]
["Rhus copallinum",null,null,null,null,null,{"$f":"SUM(COUNTIFS(C901:F901,{\"P\",\"C\",\"D\"}))","v":0},0,3.65,"Not Listed",null,"Native",3,1,10007744,1,4,2]
["Rhynchospora","Dichromena",null,null,null,null,{"$f":"SUM(COUNTIFS(C902:F902,{\"P\",\"C\",\"D\"}))","v":0},0,-9,"Not Listed","FACW","Native",3,4,40144,1,2,1]
["Rhynchospora baldwinii",null,null,null,null,null,{"$f":"SUM(COUNTIFS(C903:F903,{\"P\",\"C\",\"D\"}))","v":0},0,6.44,"Not Listed","FACW","Native",3,4,40152,1,2,1]
["Rhynchospora caduca",null,null,null,null,null,{"$f":"SUM(COUNTIFS(C904:F904,{\"P\",\"C\",\"D\"}))","v":0},0,7.61,"Not Listed","FACW","Native",3,4,40154,1,2,1]
["Rhynchospora capitellata","Rhynchospora leptocarpa",null,null,null,null,{"$f":"SUM(COUNTIFS(C905:F905,{\"P\",\"C\",\"D\"}))","v":0},0,6.4,"Not Listed","FACW","Native",3,4,40145,1,2,1]
["Rhynchospora cephalantha",null,null,null,null,null,{"$f":"SUM(COUNTIFS(C906:F906,{\"P\",\"C\",\"D\"}))","v":0},0,6.19,"Not Listed","OBL","Native",3,5,40158,1,2,1]
["Rhynchospora chalarocephala",null,null,null,null,null,{"$f":"SUM(COUNTIFS(C907:F907,{\"P\",\"C\",\"D\"}))","v":0},0,3.5,"Not Listed","FACW","Native",3,4,40159,1,2,1]
["Rhynchospora chapmanii",null,null,null,null,null,{"$f":"SUM(COUNTIFS(C908:F908,{\"P\",\"C\",\"D\"}))","v":0},0,3.33,"Not Listed","OBL","Native",3,5,40160,1,2,1]
["Rhynchospora colorata",null,null,null,null,null,{"$f":"SUM(COUNTIFS(C909:F909,{\"P\",\"C\",\"D\"}))","v":0},0,null,"Not Listed","FACW","Native",3,4,10015913,1,2,1]
["Rhynchospora corniculata",null,null,null,null,null,{"$f":"SUM(COUNTIFS(C910:F910,{\"P\",\"C\",\"D\"}))","v":0},0,4,"Not Listed","OBL","Native",3,5,40146,1,2,1]
["Rhynchospora curtissii",null,null,null,null,null,{"$f":"SUM(COUNTIFS(C911:F911,{\"P\",\"C\",\"D\"}))","v":0},0,3.75,"Not Listed","FACW","Native",3,4,40164,1,2,1]
["Rhynchospora debilis",null,null,null,null,null,{"$f":"SUM(COUNTIFS(C912:F912,{\"P\",\"C\",\"D\"}))","v":0},{"$f":"IF(OR(N912=3,N912=4,N912=5,N912=8,N912=9,Q912=7,O912=18036),G912,0)","v":0},7.8,"Not Listed","FACW","Native",3,4,10007724,1,null,1]
["Rhynchospora divergens",null,null,null,null,null,{"$f":"SUM(COUNTIFS(C913:F913,{\"P\",\"C\",\"D\"}))","v":0},0,5.53,"Not Listed","OBL","Native",3,5,40167,1,2,1]
["Rhynchospora fascicularis",null,null,null,null,null,{"$f":"SUM(COUNTIFS(C914:F914,{\"P\",\"C\",\"D\"}))","v":0},0,5.92,"Not Listed","FACW","Native",3,4,40169,1,2,1]
["Rhynchospora fernaldii",null,null,null,null,null,{"$f":"SUM(COUNTIFS(C915:F915,{\"P\",\"C\",\"D\"}))","v":0},0,4.7699999999999996,"Not Listed","FACW","Native",3,4,40170,1,null,1]
["Rhynchospora filifolia",null,null,null,null,null,{"$f":"SUM(COUNTIFS(C916:F916,{\"P\",\"C\",\"D\"}))","v":0},0,8.1300000000000008,"Not Listed","FACW","Native",3,4,40171,1,2,1]
["Rhynchospora globularis",null,null,null,null,null,{"$f":"SUM(COUNTIFS(C917:F917,{\"P\",\"C\",\"D\"}))","v":0},0,3.45,"Not Listed","FACW","Native",3,4,40173,1,2,1]
["Rhynchospora glomerata",null,null,null,null,null,{"$f":"SUM(COUNTIFS(C918:F918,{\"P\",\"C\",\"D\"}))","v":0},0,4.13,"Not Listed","FACW","Native",3,4,40174,1,2,1]
["Rhynchospora inundata",null,null,null,null,null,{"$f":"SUM(COUNTIFS(C919:F919,{\"P\",\"C\",\"D\"}))","v":0},0,4,"Not Listed","OBL","Native",3,5,40182,1,2,1]
["Rhynchospora megalocarpa",null,null,null,null,null,{"$f":"SUM(COUNTIFS(C920:F920,{\"P\",\"C\",\"D\"}))","v":0},0,-9,"Not Listed","UPL","Native",3,2,40185,1,2,1]
["Rhynchospora microcarpa",null,null,null,null,null,{"$f":"SUM(COUNTIFS(C921:F921,{\"P\",\"C\",\"D\"}))","v":0},0,5.29,"Not Listed","OBL","Native",3,5,40186,1,2,1]
["Rhynchospora microcephala",null,null,null,null,null,{"$f":"SUM(COUNTIFS(C922:F922,{\"P\",\"C\",\"D\"}))","v":0},0,3.5,"Not Listed","FACW","Native",3,4,40187,1,2,1]
["Rhynchospora miliacea",null,null,null,null,null,{"$f":"SUM(COUNTIFS(C923:F923,{\"P\",\"C\",\"D\"}))","v":0},0,4.67,"Not Listed","OBL","Native",3,5,40188,1,2,1]
["Rhynchospora nitens","Psilocarya nitens",null,null,null,null,{"$f":"SUM(COUNTIFS(C924:F924,{\"P\",\"C\",\"D\"}))","v":0},0,4,"Not Listed","OBL","Native",3,5,10007725,1,2,1]
["Rhynchospora odorata",null,null,null,null,null,{"$f":"SUM(COUNTIFS(C925:F925,{\"P\",\"C\",\"D\"}))","v":0},0,4.33,"Not Listed","FACW","Native",3,4,40190,1,2,1]
["Rhynchospora perplexa",null,null,null,null,null,{"$f":"SUM(COUNTIFS(C926:F926,{\"P\",\"C\",\"D\"}))","v":0},0,5.2,"Not Listed","FACW","Native",3,4,40193,1,2,1]
["Rhynchospora pleiantha",null,null,null,null,null,{"$f":"SUM(COUNTIFS(C927:F927,{\"P\",\"C\",\"D\"}))","v":0},0,4.63,"Not Listed","FACW","Native",3,4,10011391,1,2,1]
["Rhynchospora pusilla",null,null,null,null,null,{"$f":"SUM(COUNTIFS(C928:F928,{\"P\",\"C\",\"D\"}))","v":0},0,7.54,"Not Listed","FACW","Native",3,4,40196,1,2,1]
["Rhynchospora rariflora",null,null,null,null,null,{"$f":"SUM(COUNTIFS(C929:F929,{\"P\",\"C\",\"D\"}))","v":0},0,8.6300000000000008,"Not Listed","FACW","Native",3,4,40149,1,2,1]
["Rhynchospora scirpoides","Psilocarya scirpoides",null,null,null,null,{"$f":"SUM(COUNTIFS(C930:F930,{\"P\",\"C\",\"D\"}))","v":0},0,3.29,"Not Listed","OBL","Native",3,5,10008617,1,2,1]
["Rhynchospora tracyi",null,null,null,null,null,{"$f":"SUM(COUNTIFS(C931:F931,{\"P\",\"C\",\"D\"}))","v":0},0,8,"Not Listed","OBL","Native",3,5,40202,1,2,1]
["Rhynchospora wrightiana",null,null,null,null,null,{"$f":"SUM(COUNTIFS(C932:F932,{\"P\",\"C\",\"D\"}))","v":0},0,7.8,"Not Listed","FACW","Native",3,4,40203,1,2,1]
["Riccardia",null,null,null,null,null,{"$f":"SUM(COUNTIFS(C933:F933,{\"P\",\"C\",\"D\"}))","v":0},0,-9,"Not Listed",null,-9,3,1,15465,-9,1,1]
["Riccia",null,null,null,null,null,{"$f":"SUM(COUNTIFS(C934:F934,{\"P\",\"C\",\"D\"}))","v":0},0,null,-9,"OBL",-9,-9,8,15617,-9,3,-9]
["Ricciocarpos natans",null,null,null,null,null,{"$f":"SUM(COUNTIFS(C935:F935,{\"P\",\"C\",\"D\"}))","v":0},0,6,"Not Listed","OBL","Native",3,5,15616,1,3,1]
["Richardia","Richardia (magnoliophyta)",null,null,null,null,{"$f":"SUM(COUNTIFS(C936:F936,{\"P\",\"C\",\"D\"}))","v":0},0,null,-9,null,-9,-9,-9,35137,-9,-9,-9]
["Richardia grandiflora",null,null,null,null,null,{"$f":"SUM(COUNTIFS(C937:F937,{\"P\",\"C\",\"D\"}))","v":0},0,0,"Category 2","OBL","Exotic",2,8,10015925,2,1,1]
["Richardia scabra",null,null,null,null,null,{"$f":"SUM(COUNTIFS(C938:F938,{\"P\",\"C\",\"D\"}))","v":0},0,0,"Not Listed",null,"Exotic",3,-9,35142,2,null,1]
["Ricinus communis",null,null,null,null,null,{"$f":"SUM(COUNTIFS(C939:F939,{\"P\",\"C\",\"D\"}))","v":0},0,0,"Category 2","UPL","Exotic",2,2,28393,2,4,2]
["Rorippa",null,null,null,null,null,{"$f":"SUM(COUNTIFS(C940:F940,{\"P\",\"C\",\"D\"}))","v":0},0,null,-9,null,-9,-9,-9,22991,-9,-9,-9]
["Rorippa nasturtium-aquaticum",null,null,null,null,null,{"$f":"SUM(COUNTIFS(C941:F941,{\"P\",\"C\",\"D\"}))","v":0},0,2.93,"Not Listed","OBL","Exotic",3,5,22993,2,1,1]
["Rorippa teres",null,null,null,null,null,{"$f":"SUM(COUNTIFS(C942:F942,{\"P\",\"C\",\"D\"}))","v":0},0,4.2,"Not Listed","OBL","Native",3,5,23019,1,null,1]
["Rosa",null,null,null,null,null,{"$f":"SUM(COUNTIFS(C943:F943,{\"P\",\"C\",\"D\"}))","v":0},0,null,-9,null,-9,-9,-9,24807,-9,-9,-9]
["Rosa palustris","Rosa virginiana",null,null,null,null,{"$f":"SUM(COUNTIFS(C944:F944,{\"P\",\"C\",\"D\"}))","v":0},0,6.01,"Not Listed","OBL","Native",3,5,24809,1,5,3]
["Rotala",null,null,null,null,null,{"$f":"SUM(COUNTIFS(C945:F945,{\"P\",\"C\",\"D\"}))","v":0},0,null,-9,null,-9,-9,-9,27114,-9,-9,-9]
["Rotala ramosior",null,null,null,null,null,{"$f":"SUM(COUNTIFS(C946:F946,{\"P\",\"C\",\"D\"}))","v":0},0,null,"Not Listed","OBL","Native",3,5,27115,1,1,1]
["Rotala rotundifolia",null,null,null,null,null,{"$f":"SUM(COUNTIFS(C947:F947,{\"P\",\"C\",\"D\"}))","v":0},0,0,"Category 2","UPL","Exotic",2,2,10015867,2,1,1]
["Roystonea regia","Roystonea elata",null,null,null,null,{"$f":"SUM(COUNTIFS(C948:F948,{\"P\",\"C\",\"D\"}))","v":0},0,3.13,"Not Listed","FACW","Native",3,4,42501,1,6,2]
["Rubus",null,null,null,null,null,{"$f":"SUM(COUNTIFS(C949:F949,{\"P\",\"C\",\"D\"}))","v":0},0,-9,"Not Listed","FAC",-9,3,3,24848,-9,5,3]
["Rubus argutus","Rubus betulifolius",null,null,null,null,{"$f":"SUM(COUNTIFS(C950:F950,{\"P\",\"C\",\"D\"}))","v":0},0,3.56,"Not Listed","FAC","Native",3,3,24877,1,-9,3]
["Rubus cuneifolius",null,null,null,null,null,{"$f":"SUM(COUNTIFS(C951:F951,{\"P\",\"C\",\"D\"}))","v":0},0,3.9,"Not Listed","FAC","Native",3,3,24905,1,5,3]
["Rubus trivialis",null,null,null,null,null,{"$f":"SUM(COUNTIFS(C952:F952,{\"P\",\"C\",\"D\"}))","v":0},0,2.6,"Not Listed","FAC","Native",3,3,25067,1,5,3]
["Ruellia",null,null,null,null,null,{"$f":"SUM(COUNTIFS(C953:F953,{\"P\",\"C\",\"D\"}))","v":0},0,-9,"Split Genus","Var Genus",-9,4,9,34371,-9,1,1]
["Ruellia simplex","Ruellia brittoniana, Ruellia tweediana",null,null,null,null,{"$f":"SUM(COUNTIFS(C954:F954,{\"P\",\"C\",\"D\"}))","v":0},0,0,"Category 1","FAC","Exotic",1,3,10015686,2,1,1]
["Rumex",null,null,null,null,null,{"$f":"SUM(COUNTIFS(C955:F955,{\"P\",\"C\",\"D\"}))","v":0},0,2.23,"Not Listed","FACW",-9,3,4,20933,-9,1,1]
["Rumex crispus",null,null,null,null,null,{"$f":"SUM(COUNTIFS(C956:F956,{\"P\",\"C\",\"D\"}))","v":0},0,0,"Not Listed","FACW","Exotic",3,4,20937,2,1,1]
["Rumex hastatulus",null,null,null,null,null,{"$f":"SUM(COUNTIFS(C957:F957,{\"P\",\"C\",\"D\"}))","v":0},0,-9,"Not Listed","FACW","Native",3,4,20938,1,1,1]
["Rumex obovatus",null,null,null,null,null,{"$f":"SUM(COUNTIFS(C958:F958,{\"P\",\"C\",\"D\"}))","v":0},0,-9,"Not Listed","FACW","Exotic",3,4,10015662,2,1,1]
["Rumex verticillatus",null,null,null,null,null,{"$f":"SUM(COUNTIFS(C959:F959,{\"P\",\"C\",\"D\"}))","v":0},0,3.17,"Not Listed","FACW","Native",3,4,20946,1,1,1]
["Ruppia maritima",null,null,null,null,null,{"$f":"SUM(COUNTIFS(C960:F960,{\"P\",\"C\",\"D\"}))","v":0},0,7.24,"Not Listed","OBL","Native",3,5,39063,1,1,1]
["Sabal",null,null,null,null,null,{"$f":"SUM(COUNTIFS(C961:F961,{\"P\",\"C\",\"D\"}))","v":0},0,null,-9,null,-9,-9,-9,42502,-9,-9,-9]
["Sabal minor",null,null,null,null,null,{"$f":"SUM(COUNTIFS(C962:F962,{\"P\",\"C\",\"D\"}))","v":0},0,-9,"Not Listed","FACW","Native",3,4,42505,1,4,3]
["Sabal palmetto",null,null,null,null,null,{"$f":"SUM(COUNTIFS(C963:F963,{\"P\",\"C\",\"D\"}))","v":0},0,2.85,"Not Listed","FAC","Native",3,3,42506,1,6,2]
["Sabatia",null,null,null,null,null,{"$f":"SUM(COUNTIFS(C964:F964,{\"P\",\"C\",\"D\"}))","v":0},0,-9,"Not Listed","Var Genus","Native",3,9,30000,1,1,1]
["Sabatia brevifolia",null,null,null,null,null,{"$f":"SUM(COUNTIFS(C965:F965,{\"P\",\"C\",\"D\"}))","v":0},0,7.8,"Not Listed","FACW","Native",3,4,30008,1,1,1]
["Sabatia campanulata",null,null,null,null,null,{"$f":"SUM(COUNTIFS(C966:F966,{\"P\",\"C\",\"D\"}))","v":0},0,4.4000000000000004,"Not Listed","FACW","Native",3,4,30002,1,1,1]
["Sabatia gentianoides",null,null,null,null,null,{"$f":"SUM(COUNTIFS(C967:F967,{\"P\",\"C\",\"D\"}))","v":0},0,null,"Not Listed","FACW","Native",3,4,30013,1,null,1]
["Sabatia grandiflora",null,null,null,null,null,{"$f":"SUM(COUNTIFS(C968:F968,{\"P\",\"C\",\"D\"}))","v":0},0,6,"Not Listed","FACW","Native",3,4,30014,1,1,1]
["Saccharum",null,null,null,null,null,{"$f":"SUM(COUNTIFS(C969:F969,{\"P\",\"C\",\"D\"}))","v":0},0,-9,"Not Listed","Var Genus",-9,3,9,42054,-9,2,1]
["Saccharum baldwinii","Erianthus strictus",null,null,null,null,{"$f":"SUM(COUNTIFS(C970:F970,{\"P\",\"C\",\"D\"}))","v":0},0,5,"Not Listed","OBL","Native",3,5,10014852,1,2,1]
["Saccharum brevibarbe","Erianthus brevibarbis",null,null,null,null,{"$f":"SUM(COUNTIFS(C971:F971,{\"P\",\"C\",\"D\"}))","v":0},0,null,"Not Listed","FACW","Native",3,4,10014311,1,null,1]
["Saccharum coarctatum",null,null,null,null,null,{"$f":"SUM(COUNTIFS(C972:F972,{\"P\",\"C\",\"D\"}))","v":0},0,-9,"Not Listed",null,"Native",3,1,10015347,1,2,1]
["Saccharum giganteum","Erianthus giganteus",null,null,null,null,{"$f":"SUM(COUNTIFS(C973:F973,{\"P\",\"C\",\"D\"}))","v":0},0,5.5,"Not Listed","OBL","Native",3,5,10014252,1,2,1]
["Sacciolepis",null,null,null,null,null,{"$f":"SUM(COUNTIFS(C974:F974,{\"P\",\"C\",\"D\"}))","v":0},0,-9,"Not Listed","FAC",-9,3,3,41226,-9,2,1]
["Sacciolepis indica",null,null,null,null,null,{"$f":"SUM(COUNTIFS(C975:F975,{\"P\",\"C\",\"D\"}))","v":0},0,0.92,"Not Listed","FAC","Exotic",3,3,41228,2,2,1]
["Sacciolepis striata",null,"P","","P","P",{"$f":"SUM(COUNTIFS(C976:F976,{\"P\",\"C\",\"D\"}))","v":3},{"$f":"IF(OR(N976=3,N976=4,N976=5,N976=8,N976=9,Q976=7,O976=18036),G976,0)","v":3},5.35,"Not Listed","OBL","Native",3,5,41227,1,2,1]
["Sagittaria (native)",null,null,null,null,null,{"$f":"SUM(COUNTIFS(C977:F977,{\"P\",\"C\",\"D\"}))","v":0},0,-9,"Not Listed","OBL","Native",3,5,10015742,1,1,1]
["Sagittaria (unknown nativity)",null,null,null,null,null,{"$f":"SUM(COUNTIFS(C978:F978,{\"P\",\"C\",\"D\"}))","v":0},0,-9,"Not Listed","OBL",-9,3,5,38903,-9,1,1]
["Sagittaria filiformis",null,null,null,null,null,{"$f":"SUM(COUNTIFS(C979:F979,{\"P\",\"C\",\"D\"}))","v":0},0,7.24,"Not Listed","OBL","Native",3,5,10007728,1,1,1]
["Sagittaria graminea",null,null,null,null,null,{"$f":"SUM(COUNTIFS(C980:F980,{\"P\",\"C\",\"D\"}))","v":0},0,5.53,"Not Listed","OBL","Native",3,5,38907,1,1,1]
["Sagittaria isoetiformis",null,null,null,null,null,{"$f":"SUM(COUNTIFS(C981:F981,{\"P\",\"C\",\"D\"}))","v":0},0,7,"Not Listed","OBL","Native",3,5,38921,1,1,1]
["Sagittaria kurziana",null,null,null,null,null,{"$f":"SUM(COUNTIFS(C982:F982,{\"P\",\"C\",\"D\"}))","v":0},0,9.75,"Not Listed","OBL","Native",3,5,38922,1,1,1]
["Sagittaria lancifolia",null,null,null,null,null,{"$f":"SUM(COUNTIFS(C983:F983,{\"P\",\"C\",\"D\"}))","v":0},0,3,"Not Listed","OBL","Native",3,5,38923,1,1,1]
["Sagittaria latifolia",null,null,null,null,null,{"$f":"SUM(COUNTIFS(C984:F984,{\"P\",\"C\",\"D\"}))","v":0},0,3.5,"Not Listed","OBL","Native",3,5,38908,1,1,1]
["Sagittaria stagnorum",null,null,null,null,null,{"$f":"SUM(COUNTIFS(C985:F985,{\"P\",\"C\",\"D\"}))","v":0},0,7.24,"Not Listed","OBL","Native",3,5,38930,1,1,1]
["Sagittaria subulata",null,null,null,null,null,{"$f":"SUM(COUNTIFS(C986:F986,{\"P\",\"C\",\"D\"}))","v":0},0,7,"Not Listed","OBL","Native",3,5,38912,1,1,1]
["Salicornia",null,null,null,null,null,{"$f":"SUM(COUNTIFS(C987:F987,{\"P\",\"C\",\"D\"}))","v":0},0,-9,"Not Listed","OBL",-9,3,5,20646,-9,1,1]
["Salicornia bigelovii",null,null,null,null,null,{"$f":"SUM(COUNTIFS(C988:F988,{\"P\",\"C\",\"D\"}))","v":0},0,null,"Not Listed","OBL","Native",3,5,20649,1,null,1]
["Salix",null,null,null,null,null,{"$f":"SUM(COUNTIFS(C989:F989,{\"P\",\"C\",\"D\"}))","v":0},0,-9,"Not Listed","OBL",-9,3,5,22476,-9,6,2]
["Salix babylonica",null,null,null,null,null,{"$f":"SUM(COUNTIFS(C990:F990,{\"P\",\"C\",\"D\"}))","v":0},0,0,"Not Listed","OBL","Exotic",3,5,22503,2,6,2]
["Salix caroliniana",null,null,null,null,null,{"$f":"SUM(COUNTIFS(C991:F991,{\"P\",\"C\",\"D\"}))","v":0},0,2.95,"Not Listed","OBL","Native",3,5,22516,1,6,2]
["Salix eriocephala","Salix myricoides, Salix rigida, Salix cordata, Salix discolor",null,null,null,null,{"$f":"SUM(COUNTIFS(C992:F992,{\"P\",\"C\",\"D\"}))","v":0},0,4,"Not Listed","OBL","Native",3,5,22528,1,6,2]
["Salix floridana",null,null,null,null,null,{"$f":"SUM(COUNTIFS(C993:F993,{\"P\",\"C\",\"D\"}))","v":0},0,7.24,"Not Listed","OBL","Native",3,5,22533,1,6,2]
["Salix nigra",null,null,null,null,null,{"$f":"SUM(COUNTIFS(C994:F994,{\"P\",\"C\",\"D\"}))","v":0},0,2.13,"Not Listed","OBL","Native",3,5,22484,1,6,2]
["Salvinia",null,null,null,null,null,{"$f":"SUM(COUNTIFS(C995:F995,{\"P\",\"C\",\"D\"}))","v":0},0,-9,"Split Genus","OBL",-9,4,5,18011,-9,1,1]
["Salvinia minima",null,"P","","P","",{"$f":"SUM(COUNTIFS(C996:F996,{\"P\",\"C\",\"D\"}))","v":2},2,0,"Category 1","OBL","Exotic",1,5,10007730,2,1,1]
["Salvinia molesta",null,null,null,null,null,{"$f":"SUM(COUNTIFS(C997:F997,{\"P\",\"C\",\"D\"}))","v":0},0,0,"Not Listed",null,"Exotic",3,1,10015965,2,1,1]
["Sambucus nigra","Sambucus canadensis",null,null,null,null,{"$f":"SUM(COUNTIFS(C998:F998,{\"P\",\"C\",\"D\"}))","v":0},0,1.48,"Not Listed","FAC","Native",3,3,35324,1,5,3]
["Samolus",null,null,null,null,null,{"$f":"SUM(COUNTIFS(C999:F999,{\"P\",\"C\",\"D\"}))","v":0},0,5.67,"Not Listed","OBL","Native",3,5,24036,1,1,1]
["Samolus valerandi parviflorus","Samolus parviflorus",null,null,null,null,{"$f":"SUM(COUNTIFS(C1000:F1000,{\"P\",\"C\",\"D\"}))","v":0},0,5.67,"Not Listed","OBL","Native",3,5,10015766,1,1,1]
["Sapium sebiferum",null,null,null,null,null,{"$f":"SUM(COUNTIFS(C1001:F1001,{\"P\",\"C\",\"D\"}))","v":0},0,0,"Category 1","FAC","Exotic",1,3,28397,2,6,2]
["Sarcostemma clausum",null,null,null,null,null,{"$f":"SUM(COUNTIFS(C1002:F1002,{\"P\",\"C\",\"D\"}))","v":0},0,3.81,"Not Listed","FACW","Native",3,4,30403,1,7,1]
["Sarracenia",null,null,null,null,null,{"$f":"SUM(COUNTIFS(C1003:F1003,{\"P\",\"C\",\"D\"}))","v":0},0,-9,"Not Listed","Var Genus",-9,3,9,21992,-9,1,1]
["Sarracenia flava",null,null,null,null,null,{"$f":"SUM(COUNTIFS(C1004:F1004,{\"P\",\"C\",\"D\"}))","v":0},0,7,"Not Listed","OBL","Native",3,5,21996,1,1,1]
["Sarracenia leucophylla",null,null,null,null,null,{"$f":"SUM(COUNTIFS(C1005:F1005,{\"P\",\"C\",\"D\"}))","v":0},0,7,"Not Listed","OBL","Native",3,5,21997,1,1,1]
["Sarracenia minor",null,null,null,null,null,{"$f":"SUM(COUNTIFS(C1006:F1006,{\"P\",\"C\",\"D\"}))","v":0},0,5.67,"Not Listed","FACW","Native",3,4,21999,1,1,1]
["Sarracenia rosea","Sarracenia purpurea",null,null,null,null,{"$f":"SUM(COUNTIFS(C1007:F1007,{\"P\",\"C\",\"D\"}))","v":0},0,7.67,"Not Listed","OBL","Native",3,5,10013592,1,null,1]
["Sarracenia rubra",null,null,null,null,null,{"$f":"SUM(COUNTIFS(C1008:F1008,{\"P\",\"C\",\"D\"}))","v":0},0,8.33,"Not Listed","OBL","Native",3,5,22002,1,1,1]
["Saururus cernuus",null,null,null,null,null,{"$f":"SUM(COUNTIFS(C1009:F1009,{\"P\",\"C\",\"D\"}))","v":0},0,6.5,"Not Listed","OBL","Native",3,5,18221,1,1,1]
["Schefflera",null,null,null,null,null,{"$f":"SUM(COUNTIFS(C1010:F1010,{\"P\",\"C\",\"D\"}))","v":0},0,0,-9,null,"Exotic",-9,1,10015981,2,6,2]
["Schinus terebinthifolius",null,null,null,null,null,{"$f":"SUM(COUNTIFS(C1011:F1011,{\"P\",\"C\",\"D\"}))","v":0},0,0,"Category 1","FAC","Exotic",1,3,28812,2,6,2]
["Schizachyrium",null,null,null,null,null,{"$f":"SUM(COUNTIFS(C1012:F1012,{\"P\",\"C\",\"D\"}))","v":0},0,-9,"Not Listed","FAC",-9,3,3,42069,-9,2,1]
["Schizachyrium scoparium",null,null,null,null,null,{"$f":"SUM(COUNTIFS(C1013:F1013,{\"P\",\"C\",\"D\"}))","v":0},0,5.44,"Not Listed","FAC","Native",3,3,42076,1,2,1]
["Schoenolirion albiflorum",null,null,null,null,null,{"$f":"SUM(COUNTIFS(C1014:F1014,{\"P\",\"C\",\"D\"}))","v":0},0,9.1,"Not Listed","FACW","Native",3,4,10007733,1,null,1]
["Schoenoplectus",null,null,null,null,null,{"$f":"SUM(COUNTIFS(C1015:F1015,{\"P\",\"C\",\"D\"}))","v":0},0,-9,"Not Listed","OBL","Native",3,5,10015344,1,2,1]
["Schoenoplectus americanus",null,null,null,null,null,{"$f":"SUM(COUNTIFS(C1016:F1016,{\"P\",\"C\",\"D\"}))","v":0},0,6.5,"Not Listed","OBL","Native",3,5,10015463,1,2,1]
["Schoenoplectus californicus",null,null,null,null,null,{"$f":"SUM(COUNTIFS(C1017:F1017,{\"P\",\"C\",\"D\"}))","v":0},0,5,"Not Listed","OBL","Native",3,5,10015464,1,2,1]
["Schoenoplectus etuberculatus",null,null,null,null,null,{"$f":"SUM(COUNTIFS(C1018:F1018,{\"P\",\"C\",\"D\"}))","v":0},0,4.67,"Not Listed","OBL","Native",3,5,10015589,1,2,1]
["Schoenoplectus pungens",null,null,null,null,null,{"$f":"SUM(COUNTIFS(C1019:F1019,{\"P\",\"C\",\"D\"}))","v":0},0,4,"Not Listed","OBL","Native",3,5,10015563,1,2,1]
["Schoenoplectus robustus","Scirpus robustus",null,null,null,null,{"$f":"SUM(COUNTIFS(C1020:F1020,{\"P\",\"C\",\"D\"}))","v":0},0,5,"Not Listed","OBL","Native",3,5,10015345,1,null,1]
["Schoenoplectus tabernaemontani",null,null,null,null,null,{"$f":"SUM(COUNTIFS(C1021:F1021,{\"P\",\"C\",\"D\"}))","v":0},0,5.55,"Not Listed","OBL","Native",3,5,10015462,1,2,1]
["Scirpus",null,null,null,null,null,{"$f":"SUM(COUNTIFS(C1022:F1022,{\"P\",\"C\",\"D\"}))","v":0},0,-9,"Not Listed","OBL",-9,3,5,40225,-9,2,1]
["Scirpus cyperinus","Scirpus rubricosus",null,null,null,null,{"$f":"SUM(COUNTIFS(C1023:F1023,{\"P\",\"C\",\"D\"}))","v":0},0,3.5,"Not Listed","OBL","Native",3,5,40228,1,2,1]
["Scleria",null,null,null,null,null,{"$f":"SUM(COUNTIFS(C1024:F1024,{\"P\",\"C\",\"D\"}))","v":0},0,-9,"Split Genus","FACW",-9,4,4,40303,-9,2,1]
["Scleria baldwinii",null,null,null,null,null,{"$f":"SUM(COUNTIFS(C1025:F1025,{\"P\",\"C\",\"D\"}))","v":0},0,8.67,"Not Listed","FACW","Native",3,4,40304,1,2,1]
["Scleria ciliata",null,null,null,null,null,{"$f":"SUM(COUNTIFS(C1026:F1026,{\"P\",\"C\",\"D\"}))","v":0},0,3.67,"Not Listed","FACW","Native",3,4,40305,1,2,1]
["Scleria georgiana",null,null,null,null,null,{"$f":"SUM(COUNTIFS(C1027:F1027,{\"P\",\"C\",\"D\"}))","v":0},0,8.7799999999999994,"Not Listed","FACW","Native",3,4,40308,1,2,1]
["Scleria lacustris",null,null,null,null,null,{"$f":"SUM(COUNTIFS(C1028:F1028,{\"P\",\"C\",\"D\"}))","v":0},0,0,"Category 1","FAC","Exotic",1,3,10015730,2,2,1]
["Scleria microcarpum",null,null,null,null,null,{"$f":"SUM(COUNTIFS(C1029:F1029,{\"P\",\"C\",\"D\"}))","v":0},0,0,"Not Listed","FACW","Exotic",3,4,40327,2,null,1]
["Scleria microcarpum",null,null,null,null,null,{"$f":"SUM(COUNTIFS(C1030:F1030,{\"P\",\"C\",\"D\"}))","v":0},0,0,"Not Listed","FACW","Exotic",3,4,40327,2,2,1]
["Scleria reticularis",null,null,null,null,null,{"$f":"SUM(COUNTIFS(C1031:F1031,{\"P\",\"C\",\"D\"}))","v":0},0,6.79,"Not Listed","FACW","Native",3,4,40316,1,2,1]
["Scleria triglomerata",null,null,null,null,null,{"$f":"SUM(COUNTIFS(C1032:F1032,{\"P\",\"C\",\"D\"}))","v":0},0,6.74,"Not Listed","FACW","Native",3,4,40318,1,null,1]
["Scoparia",null,null,null,null,null,{"$f":"SUM(COUNTIFS(C1033:F1033,{\"P\",\"C\",\"D\"}))","v":0},0,null,-9,null,-9,-9,-9,34028,-9,-9,-9]
["Scoparia dulcis",null,null,null,null,null,{"$f":"SUM(COUNTIFS(C1034:F1034,{\"P\",\"C\",\"D\"}))","v":0},0,2.36,"Not Listed","FAC","Native",3,3,34029,1,1,1]
["Scutellaria",null,null,null,null,null,{"$f":"SUM(COUNTIFS(C1035:F1035,{\"P\",\"C\",\"D\"}))","v":0},0,null,"Not Listed",null,"Native",3,-9,32764,1,1,1]
["Scutellaria racemosa",null,null,null,null,null,{"$f":"SUM(COUNTIFS(C1036:F1036,{\"P\",\"C\",\"D\"}))","v":0},0,-9,"Not Listed","OBL","Exotic",3,5,10015681,2,1,1]
["Senna",null,null,null,null,null,{"$f":"SUM(COUNTIFS(C1037:F1037,{\"P\",\"C\",\"D\"}))","v":0},0,-9,"Split Genus",null,-9,4,1,10007746,-9,1,1]
["Senna obtusifolia",null,null,null,null,null,{"$f":"SUM(COUNTIFS(C1038:F1038,{\"P\",\"C\",\"D\"}))","v":0},0,1.01,"Not Listed",null,"Exotic",3,-9,10007748,2,null,1]
["Senna occidentalis",null,null,null,null,null,{"$f":"SUM(COUNTIFS(C1039:F1039,{\"P\",\"C\",\"D\"}))","v":0},0,0.37,"Not Listed",null,"Exotic",3,-9,10007747,2,null,1]
["Serenoa repens",null,null,null,null,null,{"$f":"SUM(COUNTIFS(C1040:F1040,{\"P\",\"C\",\"D\"}))","v":0},{"$f":"IF(OR(N1040=3,N1040=4,N1040=5,N1040=8,N1040=9,Q1040=7,O1040=18036),G1040,0)","v":0},7.03,"Not Listed","UPL","Native",3,2,42508,1,4,2]
["Sesbania",null,null,null,null,null,{"$f":"SUM(COUNTIFS(C1041:F1041,{\"P\",\"C\",\"D\"}))","v":0},0,-9,"Split Genus","FAC",-9,4,3,26949,-9,4,3]
["Sesbania drummondii",null,null,null,null,null,{"$f":"SUM(COUNTIFS(C1042:F1042,{\"P\",\"C\",\"D\"}))","v":0},0,1.8,"Not Listed","FAC","Native",3,3,26950,1,5,3]
["Sesbania herbacea","Sesbania exaltata, Sesbania emerus",null,null,null,null,{"$f":"SUM(COUNTIFS(C1043:F1043,{\"P\",\"C\",\"D\"}))","v":0},0,1,"Not Listed","FAC","Native",3,3,10007736,1,1,1]
["Sesbania punicea",null,null,null,null,null,{"$f":"SUM(COUNTIFS(C1044:F1044,{\"P\",\"C\",\"D\"}))","v":0},0,0,"Category 2","FAC","Exotic",2,3,26954,2,5,3]
["Sesbania vesicaria",null,null,null,null,null,{"$f":"SUM(COUNTIFS(C1045:F1045,{\"P\",\"C\",\"D\"}))","v":0},0,1.44,"Not Listed","FAC","Native",3,3,26956,1,1,1]
["Sesuvium",null,null,null,null,null,{"$f":"SUM(COUNTIFS(C1046:F1046,{\"P\",\"C\",\"D\"}))","v":0},0,-9,"Not Listed","FACW","Native",3,4,19903,1,1,1]
["Sesuvium maritimum",null,null,null,null,null,{"$f":"SUM(COUNTIFS(C1047:F1047,{\"P\",\"C\",\"D\"}))","v":0},0,-9,"Not Listed","FACW","Native",3,4,19904,1,1,1]
["Setaria",null,null,null,null,null,{"$f":"SUM(COUNTIFS(C1048:F1048,{\"P\",\"C\",\"D\"}))","v":0},0,-9,"Not Listed","Var Genus",-9,3,9,41229,-9,2,1]
["Setaria magna",null,null,null,null,null,{"$f":"SUM(COUNTIFS(C1049:F1049,{\"P\",\"C\",\"D\"}))","v":0},0,3.25,"Not Listed","OBL","Native",3,5,41230,1,2,1]
["Setaria parviflora","Setaria geniculata",null,null,null,null,{"$f":"SUM(COUNTIFS(C1050:F1050,{\"P\",\"C\",\"D\"}))","v":0},0,2.5,"Not Listed","FAC","Native",3,3,10007737,1,2,1]
["Seymeria",null,null,null,null,null,{"$f":"SUM(COUNTIFS(C1051:F1051,{\"P\",\"C\",\"D\"}))","v":0},0,null,-9,null,-9,-9,-9,34042,-9,-9,-9]
["Seymeria cassioides",null,null,null,null,null,{"$f":"SUM(COUNTIFS(C1052:F1052,{\"P\",\"C\",\"D\"}))","v":0},0,-9,"Not Listed","FAC","Native",3,3,34043,1,1,1]
["Sida","Sida (malvaceae)",null,null,null,null,{"$f":"SUM(COUNTIFS(C1053:F1053,{\"P\",\"C\",\"D\"}))","v":0},0,null,-9,null,-9,-9,-9,21724,-9,-9,-9]
["Sida rhombifolia",null,null,null,null,null,{"$f":"SUM(COUNTIFS(C1054:F1054,{\"P\",\"C\",\"D\"}))","v":0},0,1.65,"Not Listed",null,"Native",3,1,21731,1,1,1]
["Sisyrinchium",null,null,null,null,null,{"$f":"SUM(COUNTIFS(C1055:F1055,{\"P\",\"C\",\"D\"}))","v":0},0,-9,"Not Listed",null,-9,3,-9,43237,-9,2,1]
["Sium suave",null,null,null,null,null,{"$f":"SUM(COUNTIFS(C1056:F1056,{\"P\",\"C\",\"D\"}))","v":0},0,null,"Not Listed","OBL","Native",3,5,29558,1,1,1]
["Smilax",null,null,null,null,null,{"$f":"SUM(COUNTIFS(C1057:F1057,{\"P\",\"C\",\"D\"}))","v":0},0,-9,"Not Listed",null,"Native",3,1,43340,1,7,3]
["Smilax auriculata",null,null,null,null,null,{"$f":"SUM(COUNTIFS(C1058:F1058,{\"P\",\"C\",\"D\"}))","v":0},0,3.96,"Not Listed",null,"Native",3,1,43349,1,7,1]
["Smilax bona-nox",null,null,null,null,null,{"$f":"SUM(COUNTIFS(C1059:F1059,{\"P\",\"C\",\"D\"}))","v":0},0,3.78,"Not Listed",null,"Native",3,1,43341,1,7,1]
["Smilax glauca",null,null,null,null,null,{"$f":"SUM(COUNTIFS(C1060:F1060,{\"P\",\"C\",\"D\"}))","v":0},0,2.7,"Not Listed",null,"Native",3,1,43342,1,7,3]
["Smilax laurifolia",null,null,null,null,null,{"$f":"SUM(COUNTIFS(C1061:F1061,{\"P\",\"C\",\"D\"}))","v":0},0,4,"Not Listed",null,"Native",3,1,43345,1,7,3]
["Smilax pumila",null,null,null,null,null,{"$f":"SUM(COUNTIFS(C1062:F1062,{\"P\",\"C\",\"D\"}))","v":0},0,6.01,"Not Listed",null,"Native",3,1,43361,1,7,1]
["Smilax walteri",null,null,null,null,null,{"$f":"SUM(COUNTIFS(C1063:F1063,{\"P\",\"C\",\"D\"}))","v":0},0,null,"Not Listed",null,"Native",3,1,43364,1,7,1]
["Solanum",null,null,null,null,null,{"$f":"SUM(COUNTIFS(C1064:F1064,{\"P\",\"C\",\"D\"}))","v":0},0,-9,"Split Genus","Var Genus",-9,4,9,30412,-9,5,3]
["Solanum americanum",null,null,null,null,null,{"$f":"SUM(COUNTIFS(C1065:F1065,{\"P\",\"C\",\"D\"}))","v":0},0,1.1599999999999999,"Not Listed",null,"Native",3,-9,30416,1,null,1]
["Solanum carolinense",null,null,null,null,null,{"$f":"SUM(COUNTIFS(C1066:F1066,{\"P\",\"C\",\"D\"}))","v":0},0,2.13,"Not Listed",null,"Native",3,-9,30413,1,null,1]
["Solanum tampicense",null,null,null,null,null,{"$f":"SUM(COUNTIFS(C1067:F1067,{\"P\",\"C\",\"D\"}))","v":0},0,0,"Category 1",null,"Exotic",1,1,10007738,2,5,3]
["Solanum viarum",null,null,null,null,null,{"$f":"SUM(COUNTIFS(C1068:F1068,{\"P\",\"C\",\"D\"}))","v":0},0,0,"Category 1",null,"Exotic",1,1,10007739,2,5,3]
["Solidago",null,null,null,null,null,{"$f":"SUM(COUNTIFS(C1069:F1069,{\"P\",\"C\",\"D\"}))","v":0},0,-9,"Not Listed","Var Genus","Native",3,9,36223,1,1,1]
["Solidago canadensis",null,null,null,null,null,{"$f":"SUM(COUNTIFS(C1070:F1070,{\"P\",\"C\",\"D\"}))","v":0},0,2.4500000000000002,"Not Listed",null,"Native",3,1,36224,1,1,1]
["Solidago fistulosa",null,null,null,null,null,{"$f":"SUM(COUNTIFS(C1071:F1071,{\"P\",\"C\",\"D\"}))","v":0},0,4.49,"Not Listed","FACW","Native",3,4,36254,1,1,1]
["Solidago latissimifolia","Solidago elliottii",null,null,null,null,{"$f":"SUM(COUNTIFS(C1072:F1072,{\"P\",\"C\",\"D\"}))","v":0},0,7.45,"Not Listed","OBL","Native",3,5,10007740,1,null,1]
["Solidago leavenworthii",null,null,null,null,null,{"$f":"SUM(COUNTIFS(C1073:F1073,{\"P\",\"C\",\"D\"}))","v":0},0,2.73,"Not Listed","FACW","Native",3,4,36271,1,1,1]
["Solidago rugosa",null,null,null,null,null,{"$f":"SUM(COUNTIFS(C1074:F1074,{\"P\",\"C\",\"D\"}))","v":0},0,3.75,"Not Listed","FAC","Native",3,3,36299,1,1,1]
["Solidago sempervirens",null,null,null,null,null,{"$f":"SUM(COUNTIFS(C1075:F1075,{\"P\",\"C\",\"D\"}))","v":0},0,4.3600000000000003,"Not Listed","FACW","Native",3,4,36226,1,1,1]
["Solidago stricta",null,null,null,null,null,{"$f":"SUM(COUNTIFS(C1076:F1076,{\"P\",\"C\",\"D\"}))","v":0},0,5.49,"Not Listed","FACW","Native",3,4,36315,1,1,1]
["Solidago tortifolia",null,null,null,null,null,{"$f":"SUM(COUNTIFS(C1077:F1077,{\"P\",\"C\",\"D\"}))","v":0},0,6.96,"Not Listed",null,"Native",3,-9,36316,1,null,1]
["Sorghastrum secundum",null,null,null,null,null,{"$f":"SUM(COUNTIFS(C1078:F1078,{\"P\",\"C\",\"D\"}))","v":0},0,7.73,"Not Listed",null,"Native",3,-9,42103,1,null,1]
["Sorghum",null,null,null,null,null,{"$f":"SUM(COUNTIFS(C1079:F1079,{\"P\",\"C\",\"D\"}))","v":0},0,null,-9,null,-9,-9,-9,42106,-9,-9,-9]
["Sorghum bicolor",null,null,null,null,null,{"$f":"SUM(COUNTIFS(C1080:F1080,{\"P\",\"C\",\"D\"}))","v":0},0,0.11,"Not Listed",null,"Exotic",3,1,42108,2,2,1]
["Sorghum halepense",null,null,null,null,null,{"$f":"SUM(COUNTIFS(C1081:F1081,{\"P\",\"C\",\"D\"}))","v":0},0,null,"Not Listed",null,"Exotic",3,1,42111,2,2,1]
["Sparganium americanum",null,null,null,null,null,{"$f":"SUM(COUNTIFS(C1082:F1082,{\"P\",\"C\",\"D\"}))","v":0},0,6.5,"Not Listed","OBL","Native",3,5,42313,1,1,1]
["Spartina",null,null,null,null,null,{"$f":"SUM(COUNTIFS(C1083:F1083,{\"P\",\"C\",\"D\"}))","v":0},0,-9,"Not Listed","Var Genus",-9,3,9,41266,-9,2,1]
["Spartina alterniflora",null,null,null,null,null,{"$f":"SUM(COUNTIFS(C1084:F1084,{\"P\",\"C\",\"D\"}))","v":0},0,7.94,"Not Listed","OBL","Native",3,5,41267,1,2,1]
["Spartina bakeri",null,null,null,null,null,{"$f":"SUM(COUNTIFS(C1085:F1085,{\"P\",\"C\",\"D\"}))","v":0},0,5.98,"Not Listed","FACW","Native",3,4,41273,1,2,1]
["Spartina patens",null,null,null,null,null,{"$f":"SUM(COUNTIFS(C1086:F1086,{\"P\",\"C\",\"D\"}))","v":0},0,5.23,"Not Listed","FACW","Native",3,4,41271,1,2,1]
["Spermacoce",null,null,null,null,null,{"$f":"SUM(COUNTIFS(C1087:F1087,{\"P\",\"C\",\"D\"}))","v":0},0,-9,"Not Listed","Var Genus",-9,3,9,35239,-9,1,1]
["Spermacoce glabra",null,null,null,null,null,{"$f":"SUM(COUNTIFS(C1088:F1088,{\"P\",\"C\",\"D\"}))","v":0},0,4,"Not Listed","FACW","Native",3,4,35241,1,1,1]
["Spermacoce neoterminalis",null,null,null,null,null,{"$f":"SUM(COUNTIFS(C1089:F1089,{\"P\",\"C\",\"D\"}))","v":0},0,null,"Not Listed",null,"Native",3,1,10015926,1,1,1]
["Spermacoce remota","Spermacoce assurgens",null,null,null,null,{"$f":"SUM(COUNTIFS(C1090:F1090,{\"P\",\"C\",\"D\"}))","v":0},0,3.09,"Not Listed",null,"Native",3,-9,10015719,1,null,1]
["Spermacoce verticillata",null,null,null,null,null,{"$f":"SUM(COUNTIFS(C1091:F1091,{\"P\",\"C\",\"D\"}))","v":0},0,0,"Category 2","OBL","Exotic",2,8,10015900,2,5,1]
["Sphagneticola trilobata","Wedelia trilobata",null,null,null,null,{"$f":"SUM(COUNTIFS(C1092:F1092,{\"P\",\"C\",\"D\"}))","v":0},0,0,"Category 2","FACW","Exotic",2,4,10015621,2,1,1]
["Sphagnum",null,null,null,null,null,{"$f":"SUM(COUNTIFS(C1093:F1093,{\"P\",\"C\",\"D\"}))","v":0},0,7.43,"Not Listed","OBL","Native",3,5,15683,1,3,1]
["Sphenoclea zeylanica",null,null,null,null,null,{"$f":"SUM(COUNTIFS(C1094:F1094,{\"P\",\"C\",\"D\"}))","v":0},0,3,"Not Listed","FACW","Exotic",3,4,34608,2,1,1]
["Spiranthes",null,null,null,null,null,{"$f":"SUM(COUNTIFS(C1095:F1095,{\"P\",\"C\",\"D\"}))","v":0},0,null,-9,null,-9,-9,-9,43443,-9,-9,-9]
["Spiranthes odorata",null,null,null,null,null,{"$f":"SUM(COUNTIFS(C1096:F1096,{\"P\",\"C\",\"D\"}))","v":0},0,null,"Not Listed","FACW","Native",3,4,10015952,1,1,1]
["Spiranthes praecox",null,null,null,null,null,{"$f":"SUM(COUNTIFS(C1097:F1097,{\"P\",\"C\",\"D\"}))","v":0},0,-9,"Not Listed","FACW","Native",3,4,43447,1,1,1]
["Spirodela polyrhiza",null,null,null,null,null,{"$f":"SUM(COUNTIFS(C1098:F1098,{\"P\",\"C\",\"D\"}))","v":0},0,2.95,"Not Listed","OBL","Native",3,5,42599,1,1,1]
["Sporobolus",null,null,null,null,null,{"$f":"SUM(COUNTIFS(C1099:F1099,{\"P\",\"C\",\"D\"}))","v":0},0,null,-9,null,-9,-9,-9,42115,-9,-9,-9]
["Sporobolus domingensis",null,null,null,null,null,{"$f":"SUM(COUNTIFS(C1100:F1100,{\"P\",\"C\",\"D\"}))","v":0},0,2.4700000000000002,"Not Listed",null,"Native",3,-9,42134,1,null,1]
["Sporobolus indicus",null,null,null,null,null,{"$f":"SUM(COUNTIFS(C1101:F1101,{\"P\",\"C\",\"D\"}))","v":0},0,0.99,"Not Listed",null,"Exotic",3,1,42140,2,2,1]
["Sporobolus virginicus",null,null,null,null,null,{"$f":"SUM(COUNTIFS(C1102:F1102,{\"P\",\"C\",\"D\"}))","v":0},0,null,"Not Listed","OBL","Native",3,5,42127,1,2,1]
["Stenotaphrum secundatum",null,null,null,null,null,{"$f":"SUM(COUNTIFS(C1103:F1103,{\"P\",\"C\",\"D\"}))","v":0},0,1.57,"Not Listed",null,"Native",3,1,42157,1,7,1]
["Stillingia",null,null,null,null,null,{"$f":"SUM(COUNTIFS(C1104:F1104,{\"P\",\"C\",\"D\"}))","v":0},{"$f":"IF(OR(N1104=3,N1104=4,N1104=5,N1104=8,N1104=9,Q1104=7,O1104=18036),G1104,0)","v":0},null,-9,null,-9,-9,-9,28409,-9,-9,-9]
["Stillingia aquatica",null,null,null,null,null,{"$f":"SUM(COUNTIFS(C1105:F1105,{\"P\",\"C\",\"D\"}))","v":0},0,8.32,"Not Listed","OBL","Native",3,5,28410,1,5,3]
["Stillingia sylvatica",null,null,null,null,null,{"$f":"SUM(COUNTIFS(C1106:F1106,{\"P\",\"C\",\"D\"}))","v":0},0,7.3,"Not Listed","FAC","Native",3,3,28414,1,null,1]
["Styrax",null,null,null,null,null,{"$f":"SUM(COUNTIFS(C1107:F1107,{\"P\",\"C\",\"D\"}))","v":0},0,null,-9,null,-9,-9,-9,23867,-9,-9,-9]
["Styrax americanus",null,null,null,null,null,{"$f":"SUM(COUNTIFS(C1108:F1108,{\"P\",\"C\",\"D\"}))","v":0},0,4.5,"Not Listed","OBL","Native",3,5,10015586,1,4,2]
["Styrax grandifolius",null,null,null,null,null,{"$f":"SUM(COUNTIFS(C1109:F1109,{\"P\",\"C\",\"D\"}))","v":0},0,6.25,"Not Listed","OBL","Native",3,5,10015587,1,4,2]
["Suaeda linearis",null,null,null,null,null,{"$f":"SUM(COUNTIFS(C1110:F1110,{\"P\",\"C\",\"D\"}))","v":0},0,null,"Not Listed","OBL","Native",3,5,20661,1,null,1]
["Symphyotrichum",null,null,null,null,null,{"$f":"SUM(COUNTIFS(C1111:F1111,{\"P\",\"C\",\"D\"}))","v":0},0,-9,-9,null,-9,-9,0,10015677,-9,-9,-9]
["Symphyotrichum bahamense",null,null,null,null,null,{"$f":"SUM(COUNTIFS(C1112:F1112,{\"P\",\"C\",\"D\"}))","v":0},0,-9,"Not Listed","OBL","Native",3,5,10015676,1,1,1]
["Symphyotrichum carolinianum","Aster carolinianus",null,null,null,null,{"$f":"SUM(COUNTIFS(C1113:F1113,{\"P\",\"C\",\"D\"}))","v":0},0,3.93,"Not Listed","OBL","Native",3,5,10015684,1,5,3]
["Symphyotrichum dumosum","Aster dumosus",null,null,null,null,{"$f":"SUM(COUNTIFS(C1114:F1114,{\"P\",\"C\",\"D\"}))","v":0},0,2.5299999999999998,"Not Listed","FAC","Native",3,3,10015685,1,1,1]
["Symphyotrichum elliottii","Aster elliottii",null,null,null,null,{"$f":"SUM(COUNTIFS(C1115:F1115,{\"P\",\"C\",\"D\"}))","v":0},0,6.76,"Not Listed","OBL","Native",3,5,10015720,1,1,1]
["Symphyotrichum pilosum","Aster pilosus",null,null,null,null,{"$f":"SUM(COUNTIFS(C1116:F1116,{\"P\",\"C\",\"D\"}))","v":0},0,2.38,"Not Listed",null,"Native",3,-9,10015721,1,null,1]
["Symphyotrichum subulatum","Aster subulatus",null,null,null,null,{"$f":"SUM(COUNTIFS(C1117:F1117,{\"P\",\"C\",\"D\"}))","v":0},0,5.74,"Not Listed","OBL","Native",3,5,10015722,1,1,1]
["Symplocos tinctoria",null,null,null,null,null,{"$f":"SUM(COUNTIFS(C1118:F1118,{\"P\",\"C\",\"D\"}))","v":0},0,-9,"Not Listed",null,"Native",3,1,10015678,1,6,2]
["Syngonanthus flavidulus",null,null,null,null,null,{"$f":"SUM(COUNTIFS(C1119:F1119,{\"P\",\"C\",\"D\"}))","v":0},0,6.93,"Not Listed","FACW","Native",3,4,39211,1,1,1]
["Syngonium",null,null,null,null,null,{"$f":"SUM(COUNTIFS(C1120:F1120,{\"P\",\"C\",\"D\"}))","v":0},0,null,"Split Genus",null,"Exotic",4,1,42552,2,7,1]
["Syngonium podophyllum",null,null,null,null,null,{"$f":"SUM(COUNTIFS(C1121:F1121,{\"P\",\"C\",\"D\"}))","v":0},0,0,"Category 1","OBL","Exotic",1,8,10015870,2,7,1]
["Syzygium",null,null,null,null,null,{"$f":"SUM(COUNTIFS(C1122:F1122,{\"P\",\"C\",\"D\"}))","v":0},0,null,-9,null,-9,-9,-9,27274,-9,-9,-9]
["Syzygium cumini",null,null,null,null,null,{"$f":"SUM(COUNTIFS(C1123:F1123,{\"P\",\"C\",\"D\"}))","v":0},0,0,"Category 1","FAC","Exotic",1,3,10013513,2,6,2]
["Taxodium",null,"","","","P",{"$f":"SUM(COUNTIFS(C1124:F1124,{\"P\",\"C\",\"D\"}))","v":1},1,7,"Not Listed","OBL","Native",3,5,18040,1,6,2]
["Taxodium ascendens",null,null,null,null,null,{"$f":"SUM(COUNTIFS(C1125:F1125,{\"P\",\"C\",\"D\"}))","v":0},0,7,"Not Listed","OBL","Native",3,5,10007745,1,6,2]
["Taxodium distichum",null,null,null,null,null,{"$f":"SUM(COUNTIFS(C1126:F1126,{\"P\",\"C\",\"D\"}))","v":0},0,7,"Not Listed","OBL","Native",3,5,18041,1,6,2]
["Teucrium canadense",null,null,null,null,null,{"$f":"SUM(COUNTIFS(C1127:F1127,{\"P\",\"C\",\"D\"}))","v":0},0,6.44,"Not Listed","FACW","Native",3,4,32352,1,1,1]
["Thalia geniculata",null,null,null,null,null,{"$f":"SUM(COUNTIFS(C1128:F1128,{\"P\",\"C\",\"D\"}))","v":0},0,6,"Not Listed","OBL","Native",3,5,42429,1,1,1]
["Thelypteris",null,null,null,null,null,{"$f":"SUM(COUNTIFS(C1129:F1129,{\"P\",\"C\",\"D\"}))","v":0},0,-9,"Not Listed","FACW",-9,3,4,17250,-9,-9,-9]
["Thelypteris dentata",null,null,null,null,null,{"$f":"SUM(COUNTIFS(C1130:F1130,{\"P\",\"C\",\"D\"}))","v":0},0,1.62,"Not Listed","FACW","Exotic",3,4,17254,2,1,1]
["Thelypteris hispidula",null,null,null,null,null,{"$f":"SUM(COUNTIFS(C1131:F1131,{\"P\",\"C\",\"D\"}))","v":0},0,2.69,"Not Listed","FACW","Native",3,4,17256,1,1,1]
["Thelypteris interrupta",null,null,null,null,null,{"$f":"SUM(COUNTIFS(C1132:F1132,{\"P\",\"C\",\"D\"}))","v":0},0,6.74,"Not Listed","FACW","Native",3,4,17257,1,1,1]
["Thelypteris kunthii",null,null,null,null,null,{"$f":"SUM(COUNTIFS(C1133:F1133,{\"P\",\"C\",\"D\"}))","v":0},0,2.83,"Not Listed","FACW","Native",3,4,17258,1,1,1]
["Thelypteris ovata",null,null,null,null,null,{"$f":"SUM(COUNTIFS(C1134:F1134,{\"P\",\"C\",\"D\"}))","v":0},0,2.86,"Not Listed","FACW","Native",3,4,17262,1,1,1]
["Thelypteris palustris pubescens",null,null,null,null,null,{"$f":"SUM(COUNTIFS(C1135:F1135,{\"P\",\"C\",\"D\"}))","v":0},0,5.31,"Not Listed","FACW","Native",3,4,10011532,1,1,1]
["Thelypteris resinifera",null,null,null,null,null,{"$f":"SUM(COUNTIFS(C1136:F1136,{\"P\",\"C\",\"D\"}))","v":0},0,null,-9,null,-9,-9,-9,17268,-9,-9,-9]
["Thespesia populnea",null,null,null,null,null,{"$f":"SUM(COUNTIFS(C1137:F1137,{\"P\",\"C\",\"D\"}))","v":0},0,0,"Category 1","FAC","Exotic",1,3,21762,2,6,2]
["Tilia americana","Tilia caroliniana, Tilia heterophylla",null,null,null,null,{"$f":"SUM(COUNTIFS(C1138:F1138,{\"P\",\"C\",\"D\"}))","v":0},0,5.55,"Not Listed","FACW","Native",3,4,21536,1,6,2]
["Toxicodendron",null,null,null,null,null,{"$f":"SUM(COUNTIFS(C1139:F1139,{\"P\",\"C\",\"D\"}))","v":0},0,-9,"Not Listed","Var Genus","Native",3,9,28818,1,5,3]
["Toxicodendron radicans",null,null,null,null,null,{"$f":"SUM(COUNTIFS(C1140:F1140,{\"P\",\"C\",\"D\"}))","v":0},0,1.44,"Not Listed",null,"Native",3,1,28821,1,7,1]
["Toxicodendron vernix","Rhus vernix",null,null,null,null,{"$f":"SUM(COUNTIFS(C1141:F1141,{\"P\",\"C\",\"D\"}))","v":0},0,7.5,"Not Listed","FACW","Native",3,4,28823,1,6,2]
["Tradescantia",null,null,null,null,null,{"$f":"SUM(COUNTIFS(C1142:F1142,{\"P\",\"C\",\"D\"}))","v":0},0,-9,"Split Genus","Var Genus",-9,4,9,39156,-9,1,1]
["Tradescantia ohiensis",null,null,null,null,null,{"$f":"SUM(COUNTIFS(C1143:F1143,{\"P\",\"C\",\"D\"}))","v":0},0,-9,"Not Listed",null,"Native",3,1,39169,1,1,1]
["Tradescantia spathacea",null,null,null,null,null,{"$f":"SUM(COUNTIFS(C1144:F1144,{\"P\",\"C\",\"D\"}))","v":0},0,0,"Category 2","OBL","Exotic",2,8,10014732,2,1,1]
["Tradescantia zebrina",null,null,null,null,null,{"$f":"SUM(COUNTIFS(C1145:F1145,{\"P\",\"C\",\"D\"}))","v":0},0,0,"Not Listed","UPL","Exotic",3,2,10011352,2,1,1]
["Triadenum",null,null,null,null,null,{"$f":"SUM(COUNTIFS(C1146:F1146,{\"P\",\"C\",\"D\"}))","v":0},0,null,-9,null,-9,-9,-9,21472,-9,-9,-9]
["Triadenum virginicum",null,null,null,null,null,{"$f":"SUM(COUNTIFS(C1147:F1147,{\"P\",\"C\",\"D\"}))","v":0},0,5,"Not Listed","OBL","Native",3,5,21475,1,1,1]
["Triadenum walteri",null,null,null,null,null,{"$f":"SUM(COUNTIFS(C1148:F1148,{\"P\",\"C\",\"D\"}))","v":0},0,7.92,"Not Listed","OBL","Native",3,5,21476,1,1,1]
["Trifolium",null,null,null,null,null,{"$f":"SUM(COUNTIFS(C1149:F1149,{\"P\",\"C\",\"D\"}))","v":0},0,1.49,"Not Listed",null,-9,3,1,26204,-9,1,1]
["Trifolium repens",null,null,null,null,null,{"$f":"SUM(COUNTIFS(C1150:F1150,{\"P\",\"C\",\"D\"}))","v":0},0,null,-9,null,-9,-9,-9,26206,-9]
["Triglochin striata",null,null,null,null,null,{"$f":"SUM(COUNTIFS(C1151:F1151,{\"P\",\"C\",\"D\"}))","v":0},0,null,"Not Listed","OBL","Native",3,5,38990,1,2,1]
["Tripsacum",null,null,null,null,null,{"$f":"SUM(COUNTIFS(C1152:F1152,{\"P\",\"C\",\"D\"}))","v":0},0,null,-9,null,-9,-9,-9,41286,-9,-9,-9]
["Tripsacum dactyloides",null,null,null,null,null,{"$f":"SUM(COUNTIFS(C1153:F1153,{\"P\",\"C\",\"D\"}))","v":0},0,6.03,"Not Listed","FAC","Native",3,3,41287,1,2,1]
["Typha",null,"P","","","P",{"$f":"SUM(COUNTIFS(C1154:F1154,{\"P\",\"C\",\"D\"}))","v":2},2,1,"Not Listed","OBL","Native",3,5,42324,1,1,1]
["Typha domingensis",null,null,null,null,null,{"$f":"SUM(COUNTIFS(C1155:F1155,{\"P\",\"C\",\"D\"}))","v":0},0,1,"Not Listed","OBL","Native",3,5,42327,1,1,1]
["Typha latifolia",null,null,null,null,null,{"$f":"SUM(COUNTIFS(C1156:F1156,{\"P\",\"C\",\"D\"}))","v":0},0,1,"Not Listed","OBL","Native",3,5,42326,1,1,1]
["Ulmus",null,null,null,null,null,{"$f":"SUM(COUNTIFS(C1157:F1157,{\"P\",\"C\",\"D\"}))","v":0},0,-9,"Not Listed","FACW",-9,3,4,19048,-9,6,2]
["Ulmus alata",null,null,null,null,null,{"$f":"SUM(COUNTIFS(C1158:F1158,{\"P\",\"C\",\"D\"}))","v":0},0,null,"Not Listed","FACW","Native",3,4,19051,1,6,2]
["Ulmus americana",null,null,null,null,null,{"$f":"SUM(COUNTIFS(C1159:F1159,{\"P\",\"C\",\"D\"}))","v":0},0,5,"Not Listed","FACW","Native",3,4,19049,1,6,2]
["Ulmus parvifolia",null,null,null,null,null,{"$f":"SUM(COUNTIFS(C1160:F1160,{\"P\",\"C\",\"D\"}))","v":0},0,0,"Not Listed","FACW","Exotic",3,4,19055,2,6,2]
["Uniola paniculata",null,null,null,null,null,{"$f":"SUM(COUNTIFS(C1161:F1161,{\"P\",\"C\",\"D\"}))","v":0},0,6.43,"Not Listed","UPL","Native",3,2,41317,1,2,1]
["Urena",null,null,null,null,null,{"$f":"SUM(COUNTIFS(C1162:F1162,{\"P\",\"C\",\"D\"}))","v":0},0,null,-9,null,-9,-9,-9,21758,-9,-9,-9]
["Urena lobata",null,null,null,null,null,{"$f":"SUM(COUNTIFS(C1163:F1163,{\"P\",\"C\",\"D\"}))","v":0},0,0,"Category 2","UPL","Exotic",2,2,21759,2,5,3]
["Urochloa",null,null,null,null,null,{"$f":"SUM(COUNTIFS(C1164:F1164,{\"P\",\"C\",\"D\"}))","v":0},0,-9,"Split Genus","Var Genus",-9,4,9,42246,-9,2,1]
["Urochloa mutica","Brachiaria mutica",null,null,null,null,{"$f":"SUM(COUNTIFS(C1165:F1165,{\"P\",\"C\",\"D\"}))","v":0},0,0,"Category 1","FACW","Exotic",1,4,10015465,2,2,1]
["Utricularia",null,null,null,null,null,{"$f":"SUM(COUNTIFS(C1166:F1166,{\"P\",\"C\",\"D\"}))","v":0},0,6,"Not Listed","OBL","Native",3,5,34443,1,1,1]
["Utricularia cornuta",null,null,null,null,null,{"$f":"SUM(COUNTIFS(C1167:F1167,{\"P\",\"C\",\"D\"}))","v":0},0,5,"Not Listed","OBL","Native",3,5,34447,1,1,1]
["Utricularia floridana",null,null,null,null,null,{"$f":"SUM(COUNTIFS(C1168:F1168,{\"P\",\"C\",\"D\"}))","v":0},{"$f":"IF(OR(N1168=3,N1168=4,N1168=5,N1168=8,N1168=9,Q1168=7,O1168=18036),G1168,0)","v":0},6.34,"Not Listed","OBL","Native",3,5,34449,1,1,1]
["Utricularia foliosa",null,null,null,null,null,{"$f":"SUM(COUNTIFS(C1169:F1169,{\"P\",\"C\",\"D\"}))","v":0},0,5,"Not Listed","OBL","Native",3,5,34450,1,1,1]
["Utricularia gibba","Utricularia biflora, Utricularia fibrosa, Utricularia obtusa",null,null,null,null,{"$f":"SUM(COUNTIFS(C1170:F1170,{\"P\",\"C\",\"D\"}))","v":0},0,6.37,"Not Listed","OBL","Native",3,5,34452,1,1,1]
["Utricularia inflata",null,null,null,null,null,{"$f":"SUM(COUNTIFS(C1171:F1171,{\"P\",\"C\",\"D\"}))","v":0},0,5.85,"Not Listed","OBL","Native",3,5,34453,1,1,1]
["Utricularia juncea",null,null,null,null,null,{"$f":"SUM(COUNTIFS(C1172:F1172,{\"P\",\"C\",\"D\"}))","v":0},0,6.24,"Not Listed","OBL","Native",3,5,34455,1,null,1]
["Utricularia olivacea",null,null,null,null,null,{"$f":"SUM(COUNTIFS(C1173:F1173,{\"P\",\"C\",\"D\"}))","v":0},0,3.33,"Not Listed","OBL","Native",3,5,34460,1,1,1]
["Utricularia purpurea",null,null,null,null,null,{"$f":"SUM(COUNTIFS(C1174:F1174,{\"P\",\"C\",\"D\"}))","v":0},0,6.5,"Not Listed","OBL","Native",3,5,34461,1,1,1]
["Utricularia radiata",null,null,null,null,null,{"$f":"SUM(COUNTIFS(C1175:F1175,{\"P\",\"C\",\"D\"}))","v":0},0,6.01,"Not Listed","OBL","Native",3,5,34462,1,1,1]
["Utricularia resupinata",null,null,null,null,null,{"$f":"SUM(COUNTIFS(C1176:F1176,{\"P\",\"C\",\"D\"}))","v":0},0,5.46,"Not Listed","OBL","Native",3,5,34463,1,1,1]
["Utricularia subulata",null,null,null,null,null,{"$f":"SUM(COUNTIFS(C1177:F1177,{\"P\",\"C\",\"D\"}))","v":0},0,7.09,"Not Listed","OBL","Native",3,5,34465,1,1,1]
["Vaccinium",null,null,null,null,null,{"$f":"SUM(COUNTIFS(C1178:F1178,{\"P\",\"C\",\"D\"}))","v":0},0,-9,"Not Listed","Var Genus","Native",3,9,23571,1,4,2]
["Vaccinium corymbosum",null,null,null,null,null,{"$f":"SUM(COUNTIFS(C1179:F1179,{\"P\",\"C\",\"D\"}))","v":0},0,5.63,"Not Listed","FACW","Native",3,4,23573,1,4,2]
["Vaccinium darrowii",null,null,null,null,null,{"$f":"SUM(COUNTIFS(C1180:F1180,{\"P\",\"C\",\"D\"}))","v":0},0,7.15,"Not Listed",null,"Native",3,-9,23590,1,-9,2]
["Vaccinium elliottii",null,null,null,null,null,{"$f":"SUM(COUNTIFS(C1181:F1181,{\"P\",\"C\",\"D\"}))","v":0},0,4,"Not Listed","FAC","Native",3,3,23592,1,4,2]
["Vaccinium myrsinites",null,null,null,null,null,{"$f":"SUM(COUNTIFS(C1182:F1182,{\"P\",\"C\",\"D\"}))","v":0},0,5.64,"Not Listed","UPL","Native",3,2,23603,1,4,2]
["Vallisneria americana",null,null,null,null,null,{"$f":"SUM(COUNTIFS(C1183:F1183,{\"P\",\"C\",\"D\"}))","v":0},0,7,"Not Listed","OBL","Native",3,5,38951,1,1,1]
["Verbena",null,null,null,null,null,{"$f":"SUM(COUNTIFS(C1184:F1184,{\"P\",\"C\",\"D\"}))","v":0},0,null,-9,null,-9,-9,-9,32070,-9,-9,-9]
["Verbena bonariensis",null,null,null,null,null,{"$f":"SUM(COUNTIFS(C1185:F1185,{\"P\",\"C\",\"D\"}))","v":0},0,0.56000000000000005,"Not Listed",null,"Exotic",3,1,32128,2,1,1]
["Verbena brasiliensis",null,null,null,null,null,{"$f":"SUM(COUNTIFS(C1186:F1186,{\"P\",\"C\",\"D\"}))","v":0},0,0.35,"Not Listed",null,"Exotic",3,1,32086,2,1,1]
["Verbesina",null,null,null,null,null,{"$f":"SUM(COUNTIFS(C1187:F1187,{\"P\",\"C\",\"D\"}))","v":0},0,null,-9,null,-9,-9,-9,38594,-9,-9,-9]
["Verbesina virginica",null,null,null,null,null,{"$f":"SUM(COUNTIFS(C1188:F1188,{\"P\",\"C\",\"D\"}))","v":0},0,-9,"Not Listed","FAC","Native",3,3,38613,1,1,1]
["Viburnum",null,null,null,null,null,{"$f":"SUM(COUNTIFS(C1189:F1189,{\"P\",\"C\",\"D\"}))","v":0},0,null,-9,null,-9,-9,-9,35249,-9,-9,-9]
["Viburnum nudum",null,null,null,null,null,{"$f":"SUM(COUNTIFS(C1190:F1190,{\"P\",\"C\",\"D\"}))","v":0},0,5.55,"Not Listed","FACW","Native",3,4,35252,1,6,2]
["Vigna",null,null,null,null,null,{"$f":"SUM(COUNTIFS(C1191:F1191,{\"P\",\"C\",\"D\"}))","v":0},0,null,-9,null,-9,-9,-9,27015,-9,-9,-9]
["Vigna luteola",null,null,null,null,null,{"$f":"SUM(COUNTIFS(C1192:F1192,{\"P\",\"C\",\"D\"}))","v":0},0,2.31,"Not Listed",null,"Native",3,1,27016,1,7,2]
["Viola lanceolata",null,null,null,null,null,{"$f":"SUM(COUNTIFS(C1193:F1193,{\"P\",\"C\",\"D\"}))","v":0},0,5.32,"Not Listed","OBL","Native",3,5,22094,1,null,1]
["Viola primulifolia",null,null,null,null,null,{"$f":"SUM(COUNTIFS(C1194:F1194,{\"P\",\"C\",\"D\"}))","v":0},0,6.11,"Not Listed","FACW","Native",3,4,22143,1,null,1]
["Vitex",null,null,null,null,null,{"$f":"SUM(COUNTIFS(C1195:F1195,{\"P\",\"C\",\"D\"}))","v":0},0,-9,"Split Genus",null,-9,4,1,32220,-9,6,2]
["Vitex trifolia",null,null,null,null,null,{"$f":"SUM(COUNTIFS(C1196:F1196,{\"P\",\"C\",\"D\"}))","v":0},0,0,"Category 2",null,"Exotic",2,1,32223,2,6,2]
["Vitis",null,null,null,null,null,{"$f":"SUM(COUNTIFS(C1197:F1197,{\"P\",\"C\",\"D\"}))","v":0},0,-9,"Not Listed",null,"Native",3,1,28606,1,7,3]
["Vitis aestivalis",null,null,null,null,null,{"$f":"SUM(COUNTIFS(C1198:F1198,{\"P\",\"C\",\"D\"}))","v":0},0,2.48,"Not Listed",null,"Native",3,-9,28607,1,-9,1]
["Vitis cinerea",null,null,null,null,null,{"$f":"SUM(COUNTIFS(C1199:F1199,{\"P\",\"C\",\"D\"}))","v":0},0,-9,"Not Listed",null,"Native",3,1,28615,1,7,2]
["Vitis rotundifolia",null,"P","P","P","P",{"$f":"SUM(COUNTIFS(C1200:F1200,{\"P\",\"C\",\"D\"}))","v":4},4,1.18,"Not Listed",null,"Native",3,1,28609,1,7,1]
["Websteria confervoides","Eleocharis confervoides, Websteria submersa",null,null,null,null,{"$f":"SUM(COUNTIFS(C1201:F1201,{\"P\",\"C\",\"D\"}))","v":0},0,7,"Not Listed","OBL","Native",3,5,10008951,1,2,1]
["Wisteria",null,null,null,null,null,{"$f":"SUM(COUNTIFS(C1202:F1202,{\"P\",\"C\",\"D\"}))","v":0},0,null,"Not Listed","Var Genus",-9,3,9,27019,-9,-9,1]
["Wisteria frutescens",null,null,null,null,null,{"$f":"SUM(COUNTIFS(C1203:F1203,{\"P\",\"C\",\"D\"}))","v":0},0,null,"Not Listed","FACW","Native",3,4,27021,1,7,1]
["Wolffia",null,null,null,null,null,{"$f":"SUM(COUNTIFS(C1204:F1204,{\"P\",\"C\",\"D\"}))","v":0},0,-9,"Not Listed","OBL",-9,3,5,42601,-9,1,1]
["Wolffiella",null,null,null,null,null,{"$f":"SUM(COUNTIFS(C1205:F1205,{\"P\",\"C\",\"D\"}))","v":0},0,1,"Not Listed","OBL","Native",3,5,42606,1,1,1]
["Woodwardia",null,null,null,null,null,{"$f":"SUM(COUNTIFS(C1206:F1206,{\"P\",\"C\",\"D\"}))","v":0},0,null,"Not Listed","Var Genus","Native",3,9,17748,1,1,1]
["Woodwardia areolata",null,null,null,null,null,{"$f":"SUM(COUNTIFS(C1207:F1207,{\"P\",\"C\",\"D\"}))","v":0},0,6.5,"Not Listed","OBL","Native",3,5,17749,1,1,1]
["Woodwardia virginica",null,"","","","P",{"$f":"SUM(COUNTIFS(C1208:F1208,{\"P\",\"C\",\"D\"}))","v":1},1,3.5,"Not Listed","FACW","Native",3,4,17751,1,1,1]
["Xanthosoma sagittifolium",null,null,null,null,null,{"$f":"SUM(COUNTIFS(C1209:F1209,{\"P\",\"C\",\"D\"}))","v":0},0,0,"Category 2","FACW","Exotic",2,4,42586,2,1,1]
["Xyris",null,null,null,null,null,{"$f":"SUM(COUNTIFS(C1210:F1210,{\"P\",\"C\",\"D\"}))","v":0},0,-9,"Not Listed","OBL","Native",3,5,39096,1,1,1]
["Xyris ambigua",null,null,null,null,null,{"$f":"SUM(COUNTIFS(C1211:F1211,{\"P\",\"C\",\"D\"}))","v":0},0,6.43,"Not Listed","OBL","Native",3,5,10007742,1,1,1]
["Xyris baldwiniana",null,null,null,null,null,{"$f":"SUM(COUNTIFS(C1212:F1212,{\"P\",\"C\",\"D\"}))","v":0},0,6.97,"Not Listed","OBL","Native",3,5,39099,1,1,1]
["Xyris brevifolia",null,null,null,null,null,{"$f":"SUM(COUNTIFS(C1213:F1213,{\"P\",\"C\",\"D\"}))","v":0},0,7.2,"Not Listed","OBL","Native",3,5,39100,1,1,1]
["Xyris caroliniana",null,null,null,null,null,{"$f":"SUM(COUNTIFS(C1214:F1214,{\"P\",\"C\",\"D\"}))","v":0},0,6.14,"Not Listed","FACW","Native",3,4,39101,1,1,1]
["Xyris difformis",null,null,null,null,null,{"$f":"SUM(COUNTIFS(C1215:F1215,{\"P\",\"C\",\"D\"}))","v":0},0,7.5,"Not Listed","OBL","Native",3,5,39102,1,1,1]
["Xyris drummondii",null,null,null,null,null,{"$f":"SUM(COUNTIFS(C1216:F1216,{\"P\",\"C\",\"D\"}))","v":0},0,3.4,"Not Listed","OBL","Native",3,5,39103,1,1,1]
["Xyris elliottii",null,null,null,null,null,{"$f":"SUM(COUNTIFS(C1217:F1217,{\"P\",\"C\",\"D\"}))","v":0},0,6.69,"Not Listed","OBL","Native",3,5,39104,1,1,1]
["Xyris fimbriata",null,null,null,null,null,{"$f":"SUM(COUNTIFS(C1218:F1218,{\"P\",\"C\",\"D\"}))","v":0},0,5,"Not Listed","OBL","Native",3,5,39105,1,1,1]
["Xyris flabelliformis",null,null,null,null,null,{"$f":"SUM(COUNTIFS(C1219:F1219,{\"P\",\"C\",\"D\"}))","v":0},0,5,"Not Listed","OBL","Native",3,5,39106,1,1,1]
["Xyris isoetifolia",null,null,null,null,null,{"$f":"SUM(COUNTIFS(C1220:F1220,{\"P\",\"C\",\"D\"}))","v":0},0,9.75,"Not Listed","OBL","Native",3,5,39108,1,1,1]
["Xyris jupicai",null,null,null,null,null,{"$f":"SUM(COUNTIFS(C1221:F1221,{\"P\",\"C\",\"D\"}))","v":0},0,3.51,"Not Listed","FACW","Native",3,4,39109,1,1,1]
["Xyris laxifolia",null,null,null,null,null,{"$f":"SUM(COUNTIFS(C1222:F1222,{\"P\",\"C\",\"D\"}))","v":0},0,5,"Not Listed","OBL","Native",3,5,10010772,1,1,1]
["Xyris laxifolia iridifolia","Xyris iridifolia",null,null,null,null,{"$f":"SUM(COUNTIFS(C1223:F1223,{\"P\",\"C\",\"D\"}))","v":0},0,5,"Not Listed","OBL","Native",3,5,10010773,1,1,1]
["Xyris platylepis",null,null,null,null,null,{"$f":"SUM(COUNTIFS(C1224:F1224,{\"P\",\"C\",\"D\"}))","v":0},0,5.32,"Not Listed","OBL","Native",3,5,39112,1,1,1]
["Xyris serotina",null,null,null,null,null,{"$f":"SUM(COUNTIFS(C1225:F1225,{\"P\",\"C\",\"D\"}))","v":0},0,4,"Not Listed","OBL","Native",3,5,39114,1,1,1]
["Xyris smalliana",null,null,null,null,null,{"$f":"SUM(COUNTIFS(C1226:F1226,{\"P\",\"C\",\"D\"}))","v":0},0,7.8,"Not Listed","OBL","Native",3,5,39115,1,1,1]
["Zanthoxylum",null,null,null,null,null,{"$f":"SUM(COUNTIFS(C1227:F1227,{\"P\",\"C\",\"D\"}))","v":0},0,-9,"Not Listed",null,-9,3,1,28849,-9,4,2]
["Zingiber",null,null,null,null,null,{"$f":"SUM(COUNTIFS(C1228:F1228,{\"P\",\"C\",\"D\"}))","v":0},0,0,"Not Listed",null,-9,3,1,42400,-9,1,1]
["Zizania aquatica",null,null,null,null,null,{"$f":"SUM(COUNTIFS(C1229:F1229,{\"P\",\"C\",\"D\"}))","v":0},0,7.5,"Not Listed","OBL","Native",3,5,41319,1,2,1]
["Zizaniopsis miliacea",null,null,null,null,null,{"$f":"SUM(COUNTIFS(C1230:F1230,{\"P\",\"C\",\"D\"}))","v":0},0,6.21,"Not Listed","OBL","Native",3,5,41323,1,2,1]
[]
[]
[]
[]
[]
[]
[]
[]
[]
[]
[]
[]
[]
[]
[]
[]
[]
[]
[]
[]
[]
[]
[]
[]
[]
[]
[]
[]
[]
[]
[]
[]
[]
[]
[]
[]
[]
[]
[]
[]
[]
[]
[]
[]
[]
[]
[]
[]
[]
[]
[]
[]
[]
[]
[]
[]
[]
[]
[]
[]
[]
[]
[]
[]
[]
[]
[]
[]
[]
[]
[]
[]
[]
[]
[]
[]
[]
[]
[]
[]
[]
[]
[]
[]
[]
[]
[]
[]
[]
[]
[]
[]
[]
[]
[]
[]
[]
[]
[]
[]
[]
[]
[]
[]
[]
[]
[]
[]
[]
[]
[]
[]
[]
[]
[]
[]
[]
[]
[]
[]
[null,null,null,null,null,null,{"$f":"SUM(COUNTIFS(C1351:F1351,{\"P\",\"C\",\"D\"}))","v":0},{"$f":"IF(OR(N1351=3,N1351=4,N1351=5,N1351=8,N1351=9,Q1351=7,O1351=18036),G1351,0)","v":0}]
[null,null,null,null,null,null,{"$f":"SUM(COUNTIFS(C1352:F1352,{\"P\",\"C\",\"D\"}))","v":0},0]
[null,null,null,null,null,null,{"$f":"SUM(COUNTIFS(C1353:F1353,{\"P\",\"C\",\"D\"}))","v":0},0]
[null,null,null,null,null,null,{"$f":"SUM(COUNTIFS(C1354:F1354,{\"P\",\"C\",\"D\"}))","v":0},0]
[null,null,null,null,null,null,{"$f":"SUM(COUNTIFS(C1355:F1355,{\"P\",\"C\",\"D\"}))","v":0},0]
[null,null,null,null,null,null,{"$f":"SUM(COUNTIFS(C1356:F1356,{\"P\",\"C\",\"D\"}))","v":0},0]
[null,null,null,null,null,null,{"$f":"SUM(COUNTIFS(C1357:F1357,{\"P\",\"C\",\"D\"}))","v":0},0]
[null,null,null,null,null,null,{"$f":"SUM(COUNTIFS(C1358:F1358,{\"P\",\"C\",\"D\"}))","v":0},0]
[null,null,null,null,null,null,{"$f":"SUM(COUNTIFS(C1359:F1359,{\"P\",\"C\",\"D\"}))","v":0},0]
[null,null,null,null,null,null,{"$f":"SUM(COUNTIFS(C1360:F1360,{\"P\",\"C\",\"D\"}))","v":0},{"$f":"IF(OR(N1360=3,N1360=4,N1360=5,N1360=8,N1360=9,Q1360=7,O1360=18036),G1360,0)","v":0}]
[null,null,null,null,null,null,{"$f":"SUM(COUNTIFS(C1361:F1361,{\"P\",\"C\",\"D\"}))","v":0},0]
[null,null,null,null,null,null,{"$f":"SUM(COUNTIFS(C1362:F1362,{\"P\",\"C\",\"D\"}))","v":0},0]
[null,null,null,null,null,null,{"$f":"SUM(COUNTIFS(C1363:F1363,{\"P\",\"C\",\"D\"}))","v":0},0]
[null,null,null,null,null,null,{"$f":"SUM(COUNTIFS(C1364:F1364,{\"P\",\"C\",\"D\"}))","v":0},0]
[null,null,null,null,null,null,{"$f":"SUM(COUNTIFS(C1365:F1365,{\"P\",\"C\",\"D\"}))","v":0},0]
[null,null,null,null,null,null,{"$f":"SUM(COUNTIFS(C1366:F1366,{\"P\",\"C\",\"D\"}))","v":0},0]
[null,null,null,null,null,null,{"$f":"SUM(COUNTIFS(C1367:F1367,{\"P\",\"C\",\"D\"}))","v":0},0]
[null,null,null,null,null,null,{"$f":"SUM(COUNTIFS(C1368:F1368,{\"P\",\"C\",\"D\"}))","v":0},0]
[null,null,null,null,null,null,{"$f":"SUM(COUNTIFS(C1369:F1369,{\"P\",\"C\",\"D\"}))","v":0},0]
[null,null,null,null,null,null,{"$f":"SUM(COUNTIFS(C1370:F1370,{\"P\",\"C\",\"D\"}))","v":0},0]
[null,null,null,null,null,null,{"$f":"SUM(COUNTIFS(C1371:F1371,{\"P\",\"C\",\"D\"}))","v":0},0]
[null,null,null,null,null,null,{"$f":"SUM(COUNTIFS(C1372:F1372,{\"P\",\"C\",\"D\"}))","v":0},0]
[null,null,null,null,null,null,{"$f":"SUM(COUNTIFS(C1373:F1373,{\"P\",\"C\",\"D\"}))","v":0},0]
[null,null,null,null,null,null,{"$f":"SUM(COUNTIFS(C1374:F1374,{\"P\",\"C\",\"D\"}))","v":0},0]
[null,null,null,null,null,null,{"$f":"SUM(COUNTIFS(C1375:F1375,{\"P\",\"C\",\"D\"}))","v":0},0]
[null,null,null,null,null,null,{"$f":"SUM(COUNTIFS(C1376:F1376,{\"P\",\"C\",\"D\"}))","v":0},0]
[null,null,null,null,null,null,{"$f":"SUM(COUNTIFS(C1377:F1377,{\"P\",\"C\",\"D\"}))","v":0},0]
[null,null,null,null,null,null,{"$f":"SUM(COUNTIFS(C1378:F1378,{\"P\",\"C\",\"D\"}))","v":0},0]
[null,null,null,null,null,null,{"$f":"SUM(COUNTIFS(C1379:F1379,{\"P\",\"C\",\"D\"}))","v":0},0]
[null,null,null,null,null,null,{"$f":"SUM(COUNTIFS(C1380:F1380,{\"P\",\"C\",\"D\"}))","v":0},0]
[null,null,null,null,null,null,{"$f":"SUM(COUNTIFS(C1381:F1381,{\"P\",\"C\",\"D\"}))","v":0},0]
[null,null,null,null,null,null,{"$f":"SUM(COUNTIFS(C1382:F1382,{\"P\",\"C\",\"D\"}))","v":0},0]
[null,null,null,null,null,null,{"$f":"SUM(COUNTIFS(C1383:F1383,{\"P\",\"C\",\"D\"}))","v":0},0]
[null,null,null,null,null,null,{"$f":"SUM(COUNTIFS(C1384:F1384,{\"P\",\"C\",\"D\"}))","v":0},0]
[null,null,null,null,null,null,{"$f":"SUM(COUNTIFS(C1385:F1385,{\"P\",\"C\",\"D\"}))","v":0},0]
[null,null,null,null,null,null,{"$f":"SUM(COUNTIFS(C1386:F1386,{\"P\",\"C\",\"D\"}))","v":0},0]
[null,null,null,null,null,null,{"$f":"SUM(COUNTIFS(C1387:F1387,{\"P\",\"C\",\"D\"}))","v":0},0]
[null,null,null,null,null,null,{"$f":"SUM(COUNTIFS(C1388:F1388,{\"P\",\"C\",\"D\"}))","v":0},0]
[null,null,null,null,null,null,{"$f":"SUM(COUNTIFS(C1389:F1389,{\"P\",\"C\",\"D\"}))","v":0},0]
[null,null,null,null,null,null,{"$f":"SUM(COUNTIFS(C1390:F1390,{\"P\",\"C\",\"D\"}))","v":0},0]
[null,null,null,null,null,null,{"$f":"SUM(COUNTIFS(C1391:F1391,{\"P\",\"C\",\"D\"}))","v":0},0]
[null,null,null,null,null,null,{"$f":"SUM(COUNTIFS(C1392:F1392,{\"P\",\"C\",\"D\"}))","v":0},0]
[null,null,null,null,null,null,{"$f":"SUM(COUNTIFS(C1393:F1393,{\"P\",\"C\",\"D\"}))","v":0},0]
[null,null,null,null,null,null,{"$f":"SUM(COUNTIFS(C1394:F1394,{\"P\",\"C\",\"D\"}))","v":0},0]
[null,null,null,null,null,null,{"$f":"SUM(COUNTIFS(C1395:F1395,{\"P\",\"C\",\"D\"}))","v":0},0]
[null,null,null,null,null,null,{"$f":"SUM(COUNTIFS(C1396:F1396,{\"P\",\"C\",\"D\"}))","v":0},0]
[null,null,null,null,null,null,{"$f":"SUM(COUNTIFS(C1397:F1397,{\"P\",\"C\",\"D\"}))","v":0},0]
[null,null,null,null,null,null,{"$f":"SUM(COUNTIFS(C1398:F1398,{\"P\",\"C\",\"D\"}))","v":0},0]
[null,null,null,null,null,null,{"$f":"SUM(COUNTIFS(C1399:F1399,{\"P\",\"C\",\"D\"}))","v":0},0]
[null,null,null,null,null,null,{"$f":"SUM(COUNTIFS(C1400:F1400,{\"P\",\"C\",\"D\"}))","v":0},0]
[null,null,null,null,null,null,{"$f":"SUM(COUNTIFS(C1401:F1401,{\"P\",\"C\",\"D\"}))","v":0},0]
[null,null,null,null,null,null,{"$f":"SUM(COUNTIFS(C1402:F1402,{\"P\",\"C\",\"D\"}))","v":0},0]
[null,null,null,null,null,null,{"$f":"SUM(COUNTIFS(C1403:F1403,{\"P\",\"C\",\"D\"}))","v":0},0]
[null,null,null,null,null,null,{"$f":"SUM(COUNTIFS(C1404:F1404,{\"P\",\"C\",\"D\"}))","v":0},0]
[null,null,null,null,null,null,{"$f":"SUM(COUNTIFS(C1405:F1405,{\"P\",\"C\",\"D\"}))","v":0},0]
[null,null,null,null,null,null,{"$f":"SUM(COUNTIFS(C1406:F1406,{\"P\",\"C\",\"D\"}))","v":0},0]
[null,null,null,null,null,null,{"$f":"SUM(COUNTIFS(C1407:F1407,{\"P\",\"C\",\"D\"}))","v":0},0]
[null,null,null,null,null,null,{"$f":"SUM(COUNTIFS(C1408:F1408,{\"P\",\"C\",\"D\"}))","v":0},0]
[null,null,null,null,null,null,{"$f":"SUM(COUNTIFS(C1409:F1409,{\"P\",\"C\",\"D\"}))","v":0},0]
[null,null,null,null,null,null,{"$f":"SUM(COUNTIFS(C1410:F1410,{\"P\",\"C\",\"D\"}))","v":0},0]
[null,null,null,null,null,null,{"$f":"SUM(COUNTIFS(C1411:F1411,{\"P\",\"C\",\"D\"}))","v":0},0]
[null,null,null,null,null,null,{"$f":"SUM(COUNTIFS(C1412:F1412,{\"P\",\"C\",\"D\"}))","v":0},0]
[null,null,null,null,null,null,{"$f":"SUM(COUNTIFS(C1413:F1413,{\"P\",\"C\",\"D\"}))","v":0},0]
[null,null,null,null,null,null,{"$f":"SUM(COUNTIFS(C1414:F1414,{\"P\",\"C\",\"D\"}))","v":0},0]
[null,null,null,null,null,null,{"$f":"SUM(COUNTIFS(C1415:F1415,{\"P\",\"C\",\"D\"}))","v":0},0]
[null,null,null,null,null,null,{"$f":"SUM(COUNTIFS(C1416:F1416,{\"P\",\"C\",\"D\"}))","v":0},0]
[null,null,null,null,null,null,{"$f":"SUM(COUNTIFS(C1417:F1417,{\"P\",\"C\",\"D\"}))","v":0},0]
[null,null,null,null,null,null,{"$f":"SUM(COUNTIFS(C1418:F1418,{\"P\",\"C\",\"D\"}))","v":0},0]
[null,null,null,null,null,null,{"$f":"SUM(COUNTIFS(C1419:F1419,{\"P\",\"C\",\"D\"}))","v":0},0]
[null,null,null,null,null,null,{"$f":"SUM(COUNTIFS(C1420:F1420,{\"P\",\"C\",\"D\"}))","v":0},0]
[null,null,null,null,null,null,{"$f":"SUM(COUNTIFS(C1421:F1421,{\"P\",\"C\",\"D\"}))","v":0},0]
[null,null,null,null,null,null,{"$f":"SUM(COUNTIFS(C1422:F1422,{\"P\",\"C\",\"D\"}))","v":0},0]
[null,null,null,null,null,null,{"$f":"SUM(COUNTIFS(C1423:F1423,{\"P\",\"C\",\"D\"}))","v":0},0]
[null,null,null,null,null,null,{"$f":"SUM(COUNTIFS(C1424:F1424,{\"P\",\"C\",\"D\"}))","v":0},{"$f":"IF(OR(N1424=3,N1424=4,N1424=5,N1424=8,N1424=9,Q1424=7,O1424=18036),G1424,0)","v":0}]
[null,null,null,null,null,null,{"$f":"SUM(COUNTIFS(C1425:F1425,{\"P\",\"C\",\"D\"}))","v":0},0]
[null,null,null,null,null,null,{"$f":"SUM(COUNTIFS(C1426:F1426,{\"P\",\"C\",\"D\"}))","v":0},0]
[null,null,null,null,null,null,{"$f":"SUM(COUNTIFS(C1427:F1427,{\"P\",\"C\",\"D\"}))","v":0},0]
[null,null,null,null,null,null,{"$f":"SUM(COUNTIFS(C1428:F1428,{\"P\",\"C\",\"D\"}))","v":0},0]
[null,null,null,null,null,null,{"$f":"SUM(COUNTIFS(C1429:F1429,{\"P\",\"C\",\"D\"}))","v":0},0]
[null,null,null,null,null,null,{"$f":"SUM(COUNTIFS(C1430:F1430,{\"P\",\"C\",\"D\"}))","v":0},0]
[null,null,null,null,null,null,{"$f":"SUM(COUNTIFS(C1431:F1431,{\"P\",\"C\",\"D\"}))","v":0},0]
[null,null,null,null,null,null,{"$f":"SUM(COUNTIFS(C1432:F1432,{\"P\",\"C\",\"D\"}))","v":0},0]
[null,null,null,null,null,null,{"$f":"SUM(COUNTIFS(C1433:F1433,{\"P\",\"C\",\"D\"}))","v":0},0]
[null,null,null,null,null,null,{"$f":"SUM(COUNTIFS(C1434:F1434,{\"P\",\"C\",\"D\"}))","v":0},0]
[null,null,null,null,null,null,{"$f":"SUM(COUNTIFS(C1435:F1435,{\"P\",\"C\",\"D\"}))","v":0},0]
[null,null,null,null,null,null,{"$f":"SUM(COUNTIFS(C1436:F1436,{\"P\",\"C\",\"D\"}))","v":0},0]
[null,null,null,null,null,null,{"$f":"SUM(COUNTIFS(C1437:F1437,{\"P\",\"C\",\"D\"}))","v":0},0]
[null,null,null,null,null,null,{"$f":"SUM(COUNTIFS(C1438:F1438,{\"P\",\"C\",\"D\"}))","v":0},0]
[null,null,null,null,null,null,{"$f":"SUM(COUNTIFS(C1439:F1439,{\"P\",\"C\",\"D\"}))","v":0},0]
[null,null,null,null,null,null,{"$f":"SUM(COUNTIFS(C1440:F1440,{\"P\",\"C\",\"D\"}))","v":0},0]
[null,null,null,null,null,null,{"$f":"SUM(COUNTIFS(C1441:F1441,{\"P\",\"C\",\"D\"}))","v":0},0]
[null,null,null,null,null,null,{"$f":"SUM(COUNTIFS(C1442:F1442,{\"P\",\"C\",\"D\"}))","v":0},0]
[null,null,null,null,null,null,{"$f":"SUM(COUNTIFS(C1443:F1443,{\"P\",\"C\",\"D\"}))","v":0},0]
[null,null,null,null,null,null,{"$f":"SUM(COUNTIFS(C1444:F1444,{\"P\",\"C\",\"D\"}))","v":0},0]
[null,null,null,null,null,null,{"$f":"SUM(COUNTIFS(C1445:F1445,{\"P\",\"C\",\"D\"}))","v":0},0]
[null,null,null,null,null,null,{"$f":"SUM(COUNTIFS(C1446:F1446,{\"P\",\"C\",\"D\"}))","v":0},0]
[null,null,null,null,null,null,{"$f":"SUM(COUNTIFS(C1447:F1447,{\"P\",\"C\",\"D\"}))","v":0},0]
[null,null,null,null,null,null,{"$f":"SUM(COUNTIFS(C1448:F1448,{\"P\",\"C\",\"D\"}))","v":0},0]
[null,null,null,null,null,null,{"$f":"SUM(COUNTIFS(C1449:F1449,{\"P\",\"C\",\"D\"}))","v":0},0]
[null,null,null,null,null,null,{"$f":"SUM(COUNTIFS(C1450:F1450,{\"P\",\"C\",\"D\"}))","v":0},0]
[null,null,null,null,null,null,{"$f":"SUM(COUNTIFS(C1451:F1451,{\"P\",\"C\",\"D\"}))","v":0},0]
[null,null,null,null,null,null,{"$f":"SUM(COUNTIFS(C1452:F1452,{\"P\",\"C\",\"D\"}))","v":0},0]
[null,null,null,null,null,null,{"$f":"SUM(COUNTIFS(C1453:F1453,{\"P\",\"C\",\"D\"}))","v":0},0]
[null,null,null,null,null,null,{"$f":"SUM(COUNTIFS(C1454:F1454,{\"P\",\"C\",\"D\"}))","v":0},0]
[null,null,null,null,null,null,{"$f":"SUM(COUNTIFS(C1455:F1455,{\"P\",\"C\",\"D\"}))","v":0},0]
[null,null,null,null,null,null,{"$f":"SUM(COUNTIFS(C1456:F1456,{\"P\",\"C\",\"D\"}))","v":0},0]
[null,null,null,null,null,null,{"$f":"SUM(COUNTIFS(C1457:F1457,{\"P\",\"C\",\"D\"}))","v":0},0]
[null,null,null,null,null,null,{"$f":"SUM(COUNTIFS(C1458:F1458,{\"P\",\"C\",\"D\"}))","v":0},0]
[null,null,null,null,null,null,{"$f":"SUM(COUNTIFS(C1459:F1459,{\"P\",\"C\",\"D\"}))","v":0},0]
[null,null,null,null,null,null,{"$f":"SUM(COUNTIFS(C1460:F1460,{\"P\",\"C\",\"D\"}))","v":0},0]
[null,null,null,null,null,null,{"$f":"SUM(COUNTIFS(C1461:F1461,{\"P\",\"C\",\"D\"}))","v":0},0]
[null,null,null,null,null,null,{"$f":"SUM(COUNTIFS(C1462:F1462,{\"P\",\"C\",\"D\"}))","v":0},0]
[null,null,null,null,null,null,{"$f":"SUM(COUNTIFS(C1463:F1463,{\"P\",\"C\",\"D\"}))","v":0},0]
[null,null,null,null,null,null,{"$f":"SUM(COUNTIFS(C1464:F1464,{\"P\",\"C\",\"D\"}))","v":0},0]
[null,null,null,null,null,null,{"$f":"SUM(COUNTIFS(C1465:F1465,{\"P\",\"C\",\"D\"}))","v":0},0]
[null,null,null,null,null,null,{"$f":"SUM(COUNTIFS(C1466:F1466,{\"P\",\"C\",\"D\"}))","v":0},0]
[null,null,null,null,null,null,{"$f":"SUM(COUNTIFS(C1467:F1467,{\"P\",\"C\",\"D\"}))","v":0},0]
[null,null,null,null,null,null,{"$f":"SUM(COUNTIFS(C1468:F1468,{\"P\",\"C\",\"D\"}))","v":0},0]
[null,null,null,null,null,null,{"$f":"SUM(COUNTIFS(C1469:F1469,{\"P\",\"C\",\"D\"}))","v":0},0]
[null,null,null,null,null,null,{"$f":"SUM(COUNTIFS(C1470:F1470,{\"P\",\"C\",\"D\"}))","v":0},0]
[null,null,null,null,null,null,{"$f":"SUM(COUNTIFS(C1471:F1471,{\"P\",\"C\",\"D\"}))","v":0},0]
[null,null,null,null,null,null,{"$f":"SUM(COUNTIFS(C1472:F1472,{\"P\",\"C\",\"D\"}))","v":0},0]
[null,null,null,null,null,null,{"$f":"SUM(COUNTIFS(C1473:F1473,{\"P\",\"C\",\"D\"}))","v":0},0]
[null,null,null,null,null,null,{"$f":"SUM(COUNTIFS(C1474:F1474,{\"P\",\"C\",\"D\"}))","v":0},0]
[null,null,null,null,null,null,{"$f":"SUM(COUNTIFS(C1475:F1475,{\"P\",\"C\",\"D\"}))","v":0},0]
[null,null,null,null,null,null,{"$f":"SUM(COUNTIFS(C1476:F1476,{\"P\",\"C\",\"D\"}))","v":0},0]
[null,null,null,null,null,null,{"$f":"SUM(COUNTIFS(C1477:F1477,{\"P\",\"C\",\"D\"}))","v":0},0]
[null,null,null,null,null,null,{"$f":"SUM(COUNTIFS(C1478:F1478,{\"P\",\"C\",\"D\"}))","v":0},0]
[null,null,null,null,null,null,{"$f":"SUM(COUNTIFS(C1479:F1479,{\"P\",\"C\",\"D\"}))","v":0},0]
[null,null,null,null,null,null,{"$f":"SUM(COUNTIFS(C1480:F1480,{\"P\",\"C\",\"D\"}))","v":0},0]
[null,null,null,null,null,null,{"$f":"SUM(COUNTIFS(C1481:F1481,{\"P\",\"C\",\"D\"}))","v":0},0]
[null,null,null,null,null,null,{"$f":"SUM(COUNTIFS(C1482:F1482,{\"P\",\"C\",\"D\"}))","v":0},0]
[null,null,null,null,null,null,{"$f":"SUM(COUNTIFS(C1483:F1483,{\"P\",\"C\",\"D\"}))","v":0},0]
[null,null,null,null,null,null,{"$f":"SUM(COUNTIFS(C1484:F1484,{\"P\",\"C\",\"D\"}))","v":0},0]
[null,null,null,null,null,null,{"$f":"SUM(COUNTIFS(C1485:F1485,{\"P\",\"C\",\"D\"}))","v":0},0]
[null,null,null,null,null,null,{"$f":"SUM(COUNTIFS(C1486:F1486,{\"P\",\"C\",\"D\"}))","v":0},0]
[null,null,null,null,null,null,{"$f":"SUM(COUNTIFS(C1487:F1487,{\"P\",\"C\",\"D\"}))","v":0},0]
[null,null,null,null,null,null,{"$f":"SUM(COUNTIFS(C1488:F1488,{\"P\",\"C\",\"D\"}))","v":0},{"$f":"IF(OR(N1488=3,N1488=4,N1488=5,N1488=8,N1488=9,Q1488=7,O1488=18036),G1488,0)","v":0}]
[null,null,null,null,null,null,{"$f":"SUM(COUNTIFS(C1489:F1489,{\"P\",\"C\",\"D\"}))","v":0},0]
[null,null,null,null,null,null,{"$f":"SUM(COUNTIFS(C1490:F1490,{\"P\",\"C\",\"D\"}))","v":0},0]
[null,null,null,null,null,null,{"$f":"SUM(COUNTIFS(C1491:F1491,{\"P\",\"C\",\"D\"}))","v":0},0]
[null,null,null,null,null,null,{"$f":"SUM(COUNTIFS(C1492:F1492,{\"P\",\"C\",\"D\"}))","v":0},0]
[null,null,null,null,null,null,{"$f":"SUM(COUNTIFS(C1493:F1493,{\"P\",\"C\",\"D\"}))","v":0},0]
[null,null,null,null,null,null,{"$f":"SUM(COUNTIFS(C1494:F1494,{\"P\",\"C\",\"D\"}))","v":0},0]
[null,null,null,null,null,null,{"$f":"SUM(COUNTIFS(C1495:F1495,{\"P\",\"C\",\"D\"}))","v":0},0]
[null,null,null,null,null,null,{"$f":"SUM(COUNTIFS(C1496:F1496,{\"P\",\"C\",\"D\"}))","v":0},0]
[null,null,null,null,null,null,{"$f":"SUM(COUNTIFS(C1497:F1497,{\"P\",\"C\",\"D\"}))","v":0},0]
[null,null,null,null,null,null,{"$f":"SUM(COUNTIFS(C1498:F1498,{\"P\",\"C\",\"D\"}))","v":0},0]
[null,null,null,null,null,null,{"$f":"SUM(COUNTIFS(C1499:F1499,{\"P\",\"C\",\"D\"}))","v":0},0]
[null,null,null,null,null,null,{"$f":"SUM(COUNTIFS(C1500:F1500,{\"P\",\"C\",\"D\"}))","v":0},0]
[null,null,null,null,null,null,{"$f":"SUM(COUNTIFS(C1501:F1501,{\"P\",\"C\",\"D\"}))","v":0},0]
[null,null,null,null,null,null,{"$f":"SUM(COUNTIFS(C1502:F1502,{\"P\",\"C\",\"D\"}))","v":0},0]
[null,null,null,null,null,null,{"$f":"SUM(COUNTIFS(C1503:F1503,{\"P\",\"C\",\"D\"}))","v":0},0]
[null,null,null,null,null,null,{"$f":"SUM(COUNTIFS(C1504:F1504,{\"P\",\"C\",\"D\"}))","v":0},0]
[null,null,null,null,null,null,{"$f":"SUM(COUNTIFS(C1505:F1505,{\"P\",\"C\",\"D\"}))","v":0},0]
[null,null,null,null,null,null,{"$f":"SUM(COUNTIFS(C1506:F1506,{\"P\",\"C\",\"D\"}))","v":0},0]
[null,null,null,null,null,null,{"$f":"SUM(COUNTIFS(C1507:F1507,{\"P\",\"C\",\"D\"}))","v":0},0]
[null,null,null,null,null,null,{"$f":"SUM(COUNTIFS(C1508:F1508,{\"P\",\"C\",\"D\"}))","v":0},0]
[null,null,null,null,null,null,{"$f":"SUM(COUNTIFS(C1509:F1509,{\"P\",\"C\",\"D\"}))","v":0},0]
[null,null,null,null,null,null,{"$f":"SUM(COUNTIFS(C1510:F1510,{\"P\",\"C\",\"D\"}))","v":0},0]
[null,null,null,null,null,null,{"$f":"SUM(COUNTIFS(C1511:F1511,{\"P\",\"C\",\"D\"}))","v":0},0]
[null,null,null,null,null,null,{"$f":"SUM(COUNTIFS(C1512:F1512,{\"P\",\"C\",\"D\"}))","v":0},0]
[null,null,null,null,null,null,{"$f":"SUM(COUNTIFS(C1513:F1513,{\"P\",\"C\",\"D\"}))","v":0},0]
[null,null,null,null,null,null,{"$f":"SUM(COUNTIFS(C1514:F1514,{\"P\",\"C\",\"D\"}))","v":0},0]
[null,null,null,null,null,null,{"$f":"SUM(COUNTIFS(C1515:F1515,{\"P\",\"C\",\"D\"}))","v":0},0]
[null,null,null,null,null,null,{"$f":"SUM(COUNTIFS(C1516:F1516,{\"P\",\"C\",\"D\"}))","v":0},0]
[null,null,null,null,null,null,{"$f":"SUM(COUNTIFS(C1517:F1517,{\"P\",\"C\",\"D\"}))","v":0},0]
[null,null,null,null,null,null,{"$f":"SUM(COUNTIFS(C1518:F1518,{\"P\",\"C\",\"D\"}))","v":0},0]
[null,null,null,null,null,null,{"$f":"SUM(COUNTIFS(C1519:F1519,{\"P\",\"C\",\"D\"}))","v":0},0]
[null,null,null,null,null,null,{"$f":"SUM(COUNTIFS(C1520:F1520,{\"P\",\"C\",\"D\"}))","v":0},0]
[null,null,null,null,null,null,{"$f":"SUM(COUNTIFS(C1521:F1521,{\"P\",\"C\",\"D\"}))","v":0},0]
[null,null,null,null,null,null,{"$f":"SUM(COUNTIFS(C1522:F1522,{\"P\",\"C\",\"D\"}))","v":0},0]

{"sheet":"LVI Calculator","index":4,"n_rows":39,"n_cols":16,"rows_kept":39,"cut":false,"hidden":false,"merged":[[0,0,0,12],[1,10,1,12],[2,10,10,12],[11,5,11,12],[12,0,12,9],[9,0,9,4],[10,7,10,8],[10,0,10,2]]}
["LAKE VEGETATION INDEX (LVI) CALCULATOR\nBased on FDEP-SOP-002/01, LVI 2200 Vegetation Index\nCreated July 1, 2024"]
["Lake Name","Field ID","WIN Organization ID","WIN Station ID","Win Location Description","WBID","Sampling Date","Sampler #1","Sampler #2","Region","Notes"]
[{"$f":"'Site Info'!B2","v":"Low Lake"},{"$f":"'Site Info'!B7","v":0},{"$f":"'Site Info'!B4","v":"21FLA"},{"$f":"'Site Info'!B5","v":21020065},{"$f":"'Site Info'!B6","v":"LOWREF"},{"$f":"'Site Info'!B10","v":"00:00:00"},{"$f":"'Site Info'!B16","v":"00:00:00"},{"$f":"'Site Info'!B17&IF('Site Info'!C17=TRUE,\"*\",\"\")","v":"Test Testerson*"},{"$f":"'Site Info'!B18&IF('Site Info'!C18=TRUE,\"*\",\"\")","v":""},{"$f":"'LVI Taxa List'!J11","v":"North"},{"$f":"'LVI Taxa List'!K8","v":0}]
["Metric",{"$f":"B15&\" Metric Value\"","v":"Segment 1 Metric Value"},{"$f":"C15&\" Metric Value\"","v":"Segment 4 Metric Value"},{"$f":"D15&\" Metric Value\"","v":"Segment 7 Metric Value"},{"$f":"E15&\" Metric Value\"","v":"Segment 10 Metric Value"},"Regional Metric Score Equation",{"$f":"B15&\" Metric Score\"","v":"Segment 1 Metric Score"},{"$f":"C15&\" Metric Score\"","v":"Segment 4 Metric Score"},{"$f":"D15&\" Metric Score\"","v":"Segment 7 Metric Score"},{"$f":"E15&\" Metric Score\"","v":"Segment 10 Metric Score"}]
["% Native Taxa",{"$f":"SUM(COUNTIFS(B16:B2001,{\"d\",\"c\",\"p\"},$N$16:$N$2001,\"=1\",$G$16:$G$2001,\">0\"))/B9*100","v":84.210526315789465},{"$f":"SUM(COUNTIFS(C16:C2001,{\"d\",\"c\",\"p\"},$N$16:$N$2001,\"=1\",$G$16:$G$2001,\">0\"))/C9*100","v":91.666666666666657},{"$f":"SUM(COUNTIFS(D16:D2001,{\"d\",\"c\",\"p\"},$N$16:$N$2001,\"=1\",$G$16:$G$2001,\">0\"))/D9*100","v":86.666666666666671},{"$f":"SUM(COUNTIFS(E16:E2001,{\"d\",\"c\",\"p\"},$N$16:$N$2001,\"=1\",$G$16:$G$2001,\">0\"))/E9*100","v":88.888888888888886},{"$f":"VLOOKUP($J$3,DropDown!$F$2:$J$3,2,FALSE)","v":"(X-62.5)/37.5"},{"$f":"IF(VLOOKUP($J$3,DropDown!$E$7:$J$8,3,FALSE)<0,0,IF(VLOOKUP($J$3,DropDown!$E$7:$J$8,3,FALSE)>1,1,VLOOKUP($J$3,DropDown!$E$7:$J$8,3,FALSE)))","v":0.57894736842105243},{"$f":"IF(VLOOKUP($J$3,DropDown!$E$7:$J$8,4,FALSE)<0,0,IF(VLOOKUP($J$3,DropDown!$E$7:$J$8,4,FALSE)>1,1,VLOOKUP($J$3,DropDown!$E$7:$J$8,4,FALSE)))","v":0.77777777777777757},{"$f":"IF(VLOOKUP($J$3,DropDown!$E$7:$J$8,5,FALSE)<0,0,IF(VLOOKUP($J$3,DropDown!$E$7:$J$8,5,FALSE)>1,1,VLOOKUP($J$3,DropDown!$E$7:$J$8,5,FALSE)))","v":0.6444444444444446},{"$f":"IF(VLOOKUP($J$3,DropDown!$E$7:$J$8,6,FALSE)<0,0,IF(VLOOKUP($J$3,DropDown!$E$7:$J$8,6,FALSE)>1,1,VLOOKUP($J$3,DropDown!$E$7:$J$8,6,FALSE)))","v":0.70370370370370361}]
["% FLEPPC Taxa",{"$f":"SUM(COUNTIFS(B16:B2001,{\"d\",\"c\",\"p\"},$L$16:$L$2001,\"=1\",$G$16:$G$2001,\">0\"))/B9*100","v":15.789473684210526},{"$f":"SUM(COUNTIFS(C16:C2001,{\"d\",\"c\",\"p\"},$L$16:$L$2001,\"=1\",$G$16:$G$2001,\">0\"))/C9*100","v":8.3333333333333321},{"$f":"SUM(COUNTIFS(D16:D2001,{\"d\",\"c\",\"p\"},$L$16:$L$2001,\"=1\",$G$16:$G$2001,\">0\"))/D9*100","v":13.333333333333334},{"$f":"SUM(COUNTIFS(E16:E2001,{\"d\",\"c\",\"p\"},$L$16:$L$2001,\"=1\",$G$16:$G$2001,\">0\"))/E9*100","v":11.111111111111111},{"$f":"VLOOKUP($J$3,DropDown!$F$2:$J$3,3,FALSE)","v":"1-(X/30)"},{"$f":"IF(VLOOKUP($J$3,DropDown!$E$10:$J$11,3,FALSE)<0,0,IF(VLOOKUP($J$3,DropDown!$E$10:$J$11,3,FALSE)>1,1,VLOOKUP($J$3,DropDown!$E$10:$J$11,3,FALSE)))","v":0.47368421052631582},{"$f":"IF(VLOOKUP($J$3,DropDown!$E$10:$J$11,4,FALSE)<0,0,IF(VLOOKUP($J$3,DropDown!$E$10:$J$11,4,FALSE)>1,1,VLOOKUP($J$3,DropDown!$E$10:$J$11,4,FALSE)))","v":0.72222222222222232},{"$f":"IF(VLOOKUP($J$3,DropDown!$E$10:$J$11,5,FALSE)<0,0,IF(VLOOKUP($J$3,DropDown!$E$10:$J$11,5,FALSE)>1,1,VLOOKUP($J$3,DropDown!$E$10:$J$11,5,FALSE)))","v":0.55555555555555558},{"$f":"IF(VLOOKUP($J$3,DropDown!$E$10:$J$11,6,FALSE)<0,0,IF(VLOOKUP($J$3,DropDown!$E$10:$J$11,6,FALSE)>1,1,VLOOKUP($J$3,DropDown!$E$10:$J$11,6,FALSE)))","v":0.62962962962962965}]
["% Sensitive Taxa",{"$f":"SUM(COUNTIFS(B16:B2001,{\"d\",\"c\",\"p\"},$H$16:$H$2001,\">=7\",$G$16:$G$2001,\">0\"))/B9*100","v":5.2631578947368416},{"$f":"SUM(COUNTIFS(C16:C2001,{\"d\",\"c\",\"p\"},$H$16:$H$2001,\">=7\",$G$16:$G$2001,\">0\"))/C9*100","v":16.666666666666664},{"$f":"SUM(COUNTIFS(D16:D2001,{\"d\",\"c\",\"p\"},$H$16:$H$2001,\">=7\",$G$16:$G$2001,\">0\"))/D9*100","v":6.666666666666667},{"$f":"SUM(COUNTIFS(E16:E2001,{\"d\",\"c\",\"p\"},$H$16:$H$2001,\">=7\",$G$16:$G$2001,\">0\"))/E9*100","v":11.111111111111111},{"$f":"VLOOKUP($J$3,DropDown!$F$2:$J$3,4,FALSE)","v":"X/27.78"},{"$f":"IF(VLOOKUP($J$3,DropDown!$E$13:$J$14,3,FALSE)<0,0,IF(VLOOKUP($J$3,DropDown!$E$13:$J$14,3,FALSE)>1,1,VLOOKUP($J$3,DropDown!$E$13:$J$14,3,FALSE)))","v":0.18945852752832401},{"$f":"IF(VLOOKUP($J$3,DropDown!$E$13:$J$14,4,FALSE)<0,0,IF(VLOOKUP($J$3,DropDown!$E$13:$J$14,4,FALSE)>1,1,VLOOKUP($J$3,DropDown!$E$13:$J$14,4,FALSE)))","v":0.59995200383969272},{"$f":"IF(VLOOKUP($J$3,DropDown!$E$13:$J$14,5,FALSE)<0,0,IF(VLOOKUP($J$3,DropDown!$E$13:$J$14,5,FALSE)>1,1,VLOOKUP($J$3,DropDown!$E$13:$J$14,5,FALSE)))","v":0.23998080153587714},{"$f":"IF(VLOOKUP($J$3,DropDown!$E$13:$J$14,6,FALSE)<0,0,IF(VLOOKUP($J$3,DropDown!$E$13:$J$14,6,FALSE)>1,1,VLOOKUP($J$3,DropDown!$E$13:$J$14,6,FALSE)))","v":0.3999680025597952}]
["Dominant Taxa C of C",{"$f":"IF(SUM(COUNTIFS(B16:B2001,{\"d\",\"c\"},$H$16:$H$2001,\">=0\"))=0,\"\",IF(AND(ISNA(VLOOKUP(\"d\",B16:B2001,1,FALSE)),ISNA(VLOOKUP(\"c\",B16:B2001,1,FALSE))),\"\",SUM(SUMIFS($H$16:$H$2001,B16:B2001,{\"c\",\"d\"}))/SUM(COUNTIFS(B16:B2001,{\"d\",\"c\"},$H$16:$H$2001,\">=0\"))))","v":0},{"$f":"IF(SUM(COUNTIFS(C16:C2001,{\"d\",\"c\"},$H$16:$H$2001,\">=0\"))=0,\"\",IF(AND(ISNA(VLOOKUP(\"d\",C16:C2001,1,FALSE)),ISNA(VLOOKUP(\"c\",C16:C2001,1,FALSE))),\"\",SUM(SUMIFS($H$16:$H$2001,C16:C2001,{\"c\",\"d\"}))/SUM(COUNTIFS(C16:C2001,{\"d\",\"c\"},$H$16:$H$2001,\">=0\"))))","v":0},{"$f":"IF(SUM(COUNTIFS(D16:D2001,{\"d\",\"c\"},$H$16:$H$2001,\">=0\"))=0,\"\",IF(AND(ISNA(VLOOKUP(\"d\",D16:D2001,1,FALSE)),ISNA(VLOOKUP(\"c\",D16:D2001,1,FALSE))),\"\",SUM(SUMIFS($H$16:$H$2001,D16:D2001,{\"c\",\"d\"}))/SUM(COUNTIFS(D16:D2001,{\"d\",\"c\"},$H$16:$H$2001,\">=0\"))))","v":0},{"$f":"IF(SUM(COUNTIFS(E16:E2001,{\"d\",\"c\"},$H$16:$H$2001,\">=0\"))=0,\"\",IF(AND(ISNA(VLOOKUP(\"d\",E16:E2001,1,FALSE)),ISNA(VLOOKUP(\"c\",E16:E2001,1,FALSE))),\"\",SUM(SUMIFS($H$16:$H$2001,E16:E2001,{\"c\",\"d\"}))/SUM(COUNTIFS(E16:E2001,{\"d\",\"c\"},$H$16:$H$2001,\">=0\"))))","v":0},{"$f":"VLOOKUP($J$3,DropDown!$F$2:$J$3,5,FALSE)","v":"X/7.91"},{"$f":"IF(VLOOKUP($J$3,DropDown!$E$16:$J$17,3,FALSE)=\"\",\"\",IF(VLOOKUP($J$3,DropDown!$E$16:$J$17,3,FALSE)<0,0,IF(VLOOKUP($J$3,DropDown!$E$16:$J$17,3,FALSE)>1,1,VLOOKUP($J$3,DropDown!$E$16:$J$17,3,FALSE))))","v":0},{"$f":"IF(VLOOKUP($J$3,DropDown!$E$16:$J$17,4,FALSE)=\"\",\"\",IF(VLOOKUP($J$3,DropDown!$E$16:$J$17,4,FALSE)<0,0,IF(VLOOKUP($J$3,DropDown!$E$16:$J$17,4,FALSE)>1,1,VLOOKUP($J$3,DropDown!$E$16:$J$17,4,FALSE))))","v":0},{"$f":"IF(VLOOKUP($J$3,DropDown!$E$16:$J$17,5,FALSE)=\"\",\"\",IF(VLOOKUP($J$3,DropDown!$E$16:$J$17,5,FALSE)<0,0,IF(VLOOKUP($J$3,DropDown!$E$16:$J$17,5,FALSE)>1,1,VLOOKUP($J$3,DropDown!$E$16:$J$17,5,FALSE))))","v":0},{"$f":"IF(VLOOKUP($J$3,DropDown!$E$16:$J$17,6,FALSE)=\"\",\"\",IF(VLOOKUP($J$3,DropDown!$E$16:$J$17,6,FALSE)<0,0,IF(VLOOKUP($J$3,DropDown!$E$16:$J$17,6,FALSE)>1,1,VLOOKUP($J$3,DropDown!$E$16:$J$17,6,FALSE))))","v":0}]
["Total Taxa LVI Present",{"$f":"SUM(COUNTIFS(B16:B2001,{\"P\",\"C\",\"D\"}))","v":19},{"$f":"SUM(COUNTIFS(C16:C2001,{\"P\",\"C\",\"D\"}))","v":12},{"$f":"SUM(COUNTIFS(D16:D2001,{\"P\",\"C\",\"D\"}))","v":15},{"$f":"SUM(COUNTIFS(E16:E2001,{\"P\",\"C\",\"D\"}))","v":18}]
[null,null,null,null,null,"Segment LVI Score",{"$f":"AVERAGE(G5:G8)*100","v":31.052252661892304},{"$f":"AVERAGE(H5:H8)*100","v":52.498800095992316},{"$f":"AVERAGE(I5:I8)*100","v":35.99952003839693},{"$f":"AVERAGE(J5:J8)*100","v":43.332533397328213}]
[null,null,null,null,null,null,null,"Lake LVI Score",null,{"$f":"IF(OR(ISBLANK(G10),ISBLANK(H10),ISBLANK(I10),ISBLANK(J10)),\"\",AVERAGE(G10:J10))","v":40.720776548402441}]
["Number of Total / Dominant / Co-Dominant Taxa entered",{"$f":"SUM(COUNTIFS(B16:B2000,{\"p\",\"c\",\"d\"}))&\" / \"& COUNTIFS(B16:B2000,\"d\")&\" / \"& COUNTIFS(B16:B2000,\"c\")","v":"19 / 1 / 0"},{"$f":"SUM(COUNTIFS(C16:C2000,{\"p\",\"c\",\"d\"}))&\" / \"& COUNTIFS(C16:C2000,\"d\")&\" / \"& COUNTIFS(C16:C2000,\"c\")","v":"12 / 1 / 0"},{"$f":"SUM(COUNTIFS(D16:D2000,{\"p\",\"c\",\"d\"}))&\" / \"& COUNTIFS(D16:D2000,\"d\")&\" / \"& COUNTIFS(D16:D2000,\"c\")","v":"15 / 1 / 0"},{"$f":"SUM(COUNTIFS(E16:E2000,{\"p\",\"c\",\"d\"}))&\" / \"& COUNTIFS(E16:E2000,\"d\")&\" / \"& COUNTIFS(E16:E2000,\"c\")","v":"18 / 1 / 0"}]
["Plant Taxa present as selected on the Taxa List Tab"]
[]
["Taxon",{"$f":"'LVI Taxa List'!C15","v":"Segment 1"},{"$f":"'LVI Taxa List'!D15","v":"Segment 4"},{"$f":"'LVI Taxa List'!E15","v":"Segment 7"},{"$f":"'LVI Taxa List'!F15","v":"Segment 10"},"Occurrences","Occurrences of LVI Taxon","C of C Score","FLEPPC Status","Wetland Status","Nativity","FLEPPC Code","Wetland Status Code","FL Native","Growth Habit","HERB WOOD"]
["Acer rubrum","P","P","P","P",4,4,4.6500000000000004,"Not Listed","FACW","Native",3,4,1,6,2]
["Boehmeria cylindrica","P","","P","P",3,3,5,"Not Listed","OBL","Native",3,5,1,1,1]
["Cephalanthus occidentalis","P","P","","P",3,3,5,"Not Listed","OBL","Native",3,5,1,4,2]
["Cyperus odoratus","P","","","",1,1,3,"Not Listed","FACW","Native",3,4,1,2,1]
["Eichhornia crassipes","D","D","D","D",4,4,0,"Category 1","OBL","Exotic",1,5,2,1,1]
["Eupatorium capillifolium","P","","","",1,1,0.83,"Not Listed","FAC","Native",3,3,1,1,1]
["Hydrocotyle","P","P","","P",3,3,2,"Not Listed","FACW","Native",3,4,1,1,1]
["Ilex cassine","P","P","P","P",4,4,6,"Not Listed","OBL","Native",3,5,1,6,2]
["Lemna","P","","P","P",3,3,1,"Not Listed","OBL","Native",3,5,1,1,1]
["Liquidambar styraciflua","","","P","P",2,2,2.5,"Not Listed","FACW","Native",3,4,1,6,2]
["Ludwigia peruviana","P","","","P",2,2,0,"Category 1","OBL","Exotic",1,5,2,1,1]
["Myrica cerifera","P","P","P","P",4,4,2,"Not Listed","FAC","Native",3,3,1,4,2]
["Nyssa sylvatica biflora","P","P","P","",3,3,7,"Not Listed","OBL","Native",3,5,1,6,2]
["Osmunda regalis","","P","","P",2,2,7.6,"Not Listed","OBL","Native",3,5,1,1,1]
["Panicum hemitomon","P","","P","P",3,3,5.82,"Not Listed","OBL","Native",3,5,1,2,1]
["Persicaria punctata","P","P","P","P",4,4,3,"Not Listed","OBL","Native",3,5,1,1,1]
["Pinus elliottii","P","P","P","",3,3,4.21,"Not Listed",null,"Native",3,1,1,6,2]
["Quercus nigra","","P","P","",2,2,2.5,"Not Listed","FACW","Native",3,4,1,6,2]
["Sacciolepis striata","P","","P","P",3,3,5.35,"Not Listed","OBL","Native",3,5,1,2,1]
["Salvinia minima","P","","P","",2,2,0,"Category 1","OBL","Exotic",1,5,2,1,1]
["Taxodium","","","","P",1,1,7,"Not Listed","OBL","Native",3,5,1,6,2]
["Typha","P","","","P",2,2,1,"Not Listed","OBL","Native",3,5,1,1,1]
["Vitis rotundifolia","P","P","P","P",4,4,1.18,"Not Listed",null,"Native",3,1,1,7,1]
["Woodwardia virginica","","","","P",1,1,3.5,"Not Listed","FACW","Native",3,4,1,1,1]

{"sheet":"4.Lake_Observation","index":5,"n_rows":90,"n_cols":49,"rows_kept":90,"cut":false,"hidden":false,"merged":[[12,32,13,37],[13,2,13,7],[13,8,13,11],[13,12,13,15],[6,37,6,48],[5,9,5,14],[5,2,5,8],[5,16,6,21],[11,39,13,48],[71,33,71,35],[67,31,68,45],[55,40,57,43],[56,44,56,47],[58,40,60,43],[69,3,69,4],[69,18,69,25],[71,3,71,5],[71,7,71,14],[71,18,71,22],[71,23,71,29],[58,2,60,5],[58,31,60,34],[59,7,59,29],[61,2,62,7],[61,8,62,15],[61,31,62,36],[62,18,62,23],[62,25,62,26],[13,29,13,31],[14,29,14,31],[14,33,14,36],[14,39,14,40],[14,41,14,46],[15,39,17,48],[3,2,3,4],[3,5,3,12],[3,24,3,28],[3,33,3,36],[3,37,3,48],[7,2,7,8],[7,9,7,32],[7,33,7,36],[7,37,7,48],[9,27,9,32],[9,33,9,48],[4,2,4,4],[4,5,4,12],[4,24,4,28],[4,33,4,36],[4,37,4,48],[5,22,5,48],[6,33,6,36],[14,3,14,6],[14,8,14,10],[14,12,14,15],[14,17,14,19],[14,21,14,23],[14,25,14,27],[13,16,13,20],[13,21,13,24],[13,25,13,28],[23,39,25,48],[24,2,24,7],[17,30,17,38],[20,2,20,11],[20,13,20,16],[20,19,20,20],[20,23,20,25],[20,28,20,29],[20,32,20,33],[22,1,22,8],[22,12,22,15],[22,21,22,24],[22,31,22,34],[22,41,22,43],[17,2,17,13],[17,15,17,16],[17,19,17,20],[17,23,17,25],[17,28,17,29],[26,29,26,30],[26,3,26,7],[26,9,26,10],[26,11,26,12],[26,13,26,14],[26,15,26,16],[26,17,26,18],[23,2,23,8],[23,9,25,18],[23,19,25,28],[23,29,25,38],[30,13,30,14],[30,15,30,16],[30,17,30,18],[26,43,26,44],[26,45,26,46],[26,47,26,48],[27,2,27,8],[27,9,29,18],[27,19,29,28],[27,29,29,38],[27,39,29,48],[28,2,28,7],[29,3,29,7],[26,31,26,32],[26,33,26,34],[26,35,26,36],[26,37,26,38],[26,39,26,40],[26,41,26,42],[26,19,26,20],[26,21,26,22],[26,23,26,24],[26,25,26,26],[26,27,26,28],[30,43,30,44],[30,45,30,46],[30,47,30,48],[31,2,31,8],[31,9,33,18],[31,19,33,28],[31,29,33,38],[31,39,33,48],[32,2,32,7],[30,31,30,32],[30,33,30,34],[30,35,30,36],[30,37,30,38],[30,39,30,40],[30,41,30,42],[30,19,30,20],[30,21,30,22],[30,23,30,24],[30,25,30,26],[30,27,30,28],[30,29,30,30],[30,3,30,7],[30,9,30,10],[30,11,30,12],[34,43,34,44],[34,45,34,46],[34,47,34,48],[37,2,37,5],[37,31,37,36],[37,39,37,41],[34,31,34,32],[34,33,34,34],[34,35,34,36],[34,37,34,38],[34,39,34,40],[34,41,34,42],[34,19,34,20],[34,21,34,22],[34,23,34,24],[34,25,34,26],[34,27,34,28],[34,29,34,30],[34,3,34,7],[34,9,34,10],[34,11,34,12],[34,13,34,14],[34,15,34,16],[34,17,34,18],[38,33,38,35],[38,37,38,40],[38,43,38,47],[40,3,40,11],[40,13,40,14],[40,17,40,18],[40,20,40,21],[40,22,40,26],[40,29,40,30],[38,3,38,11],[38,13,38,14],[38,17,38,18],[38,20,38,23],[38,25,38,26],[38,29,38,30],[42,39,42,41],[44,3,44,11],[44,13,44,14],[44,17,44,19],[44,33,44,36],[44,38,44,39],[44,41,44,42],[42,3,42,11],[42,13,42,14],[42,17,42,18],[42,20,42,22],[42,24,42,28],[42,31,42,37],[44,43,44,47],[47,2,47,5],[47,10,47,11],[47,13,47,14],[47,16,47,17],[47,18,47,21],[47,25,47,26],[47,37,47,38],[47,6,47,9],[47,22,47,24],[47,31,48,34],[47,40,48,43],[48,2,48,5],[48,7,48,8],[48,10,48,11],[48,13,48,14],[48,16,48,17],[48,19,48,20],[48,25,48,26],[48,21,48,23],[49,2,50,5],[49,7,49,8],[49,10,49,11],[49,13,49,14],[49,16,49,17],[49,19,49,20],[49,22,49,23],[49,25,49,26],[51,42,51,44],[51,2,51,5],[51,7,51,8],[51,10,51,11],[51,13,51,14],[51,16,51,17],[51,19,51,20],[51,22,51,23],[51,25,51,26],[51,46,52,48],[53,19,53,20],[53,22,53,23],[53,25,53,26],[53,33,53,39],[54,2,54,5],[55,31,57,34],[52,2,52,5],[53,2,53,5],[53,7,53,8],[53,10,53,11],[53,13,53,14],[53,16,53,17],[56,2,56,5],[56,7,56,8],[56,10,56,11],[56,13,56,14],[56,16,56,17],[56,19,56,20],[56,22,56,23],[56,25,56,26],[56,35,56,38],[51,33,51,35],[51,37,51,39],[75,31,75,33],[75,34,75,36],[75,37,86,48],[77,2,77,11],[63,3,63,4],[63,18,63,25],[63,33,63,35],[65,3,65,5],[65,7,65,14],[65,18,65,22],[65,23,65,29],[65,33,65,35],[67,2,68,7],[67,8,68,15],[76,21,77,26],[89,2,89,7],[89,8,89,36],[89,37,89,39],[89,40,89,47],[0,1,0,48],[1,1,2,48],[82,21,83,26],[83,2,83,13],[85,2,85,10],[85,18,85,20],[87,1,87,8],[88,1,88,48],[78,21,79,26],[79,2,79,11],[80,21,81,26],[81,2,81,4],[81,5,81,10],[81,11,81,14],[81,15,81,19],[73,2,74,13],[73,21,74,24],[73,37,74,48],[75,2,75,11],[75,27,75,28]]}
[null,"Instructions:  Fill in All Information in Blue Shaded Cells all other information is auto populated from other sheets."]
[null,"Lake Observations From DEP Form FD 9000-31: Lake Observation Field Sheet"]
[]
[null,null,"COUNTY:",null,null,{"$f":"'Site Info'!B8","v":"Dixie"},null,null,null,null,null,null,null,null,null,null,null,null,"WIN STATION ID:",null,null,null,null,null,{"$f":"'Site Info'!B4&\" \"&'Site Info'!B5","v":"21FLA 21020065"},null,null,null,null,null,null,null,null,"LATITUDE:",null,null,null,{"$f":"'Site Info'!B13","v":30.221693999999999}]
[null,null,"DATE:",null,null,{"$f":"'Site Info'!B15","v":"2025-07-29"},null,null,null,null,null,null,null,null,null,null,null,null,"TIME:",null,null,null,null,null,{"$f":"'Site Info'!B16","v":"00:00:00"},null,null,null,null,null,null,null,null,"LONGITUDE:",null,null,null,{"$f":"'Site Info'!B12","v":-82.836305999999993}]
[null,null,"SURVEY/PROJECT:",null,null,null,null,null,null,{"$f":"'Site Info'!B19","v":"TEST 1"},null,null,null,null,null,null,"SITE NAME AND DESCRIPTION:",null,null,null,null,null,{"$f":"'Site Info'!B2&\" \"&'Site Info'!B6","v":"Low Lake LOWREF"}]
[null,null,null,null,null,null,null,null,null,null,null,null,null,null,null,null,null,null,null,null,null,null,null,null,null,null,null,null,null,null,null,null,null,"LAKE SIZE",null,null,null,{"$f":"'Site Info'!B10&\" \"&'Site Info'!B11","v":" "}]
[null,null,"SAMPLING AGENCY:",null,null,null,null,null,null,{"$f":"'Site Info'!B3","v":"Northeast District Biologists"},null,null,null,null,null,null,null,null,null,null,null,null,null,null,null,null,null,null,null,null,null,null,null,"FIELD ID:",null,null,null,{"$f":"'Site Info'!B7","v":0}]
[]
[null,null,"WATERSHED / LAKESIDE FEATURES",null,null,null,null,null,null,null,null,null,null,null,null,null,null,null,null,null,null,null,null,null,null,null,null,"Other Land-Use: "]
[]
[null,null,null,"PREDOMINANT LAKESIDE LAND-USE  (specify relative percent in each category – from GIS ) :",null,null,null,null,null,null,null,null,null,null,null,null,null,null,null,null,null,null,null,null,null,null,null,null,null,null,null,null,null,null,null,null,null,null,null,"LANDSCAPE DEVELOPMENT INTENSITY (100 m buffer)"]
[null,null,null,null,null,null,null,null,null,null,null,null,null,null,null,null,null,null,null,null,null,null,null,null,null,null,null,null,null,null,null,null,"Other \n(Specify Above)"]
[null,null,"Forest/Natural",null,null,null,null,null,"Silviculture",null,null,null,"Field/Pasture",null,null,null,"Agricultural",null,null,null,null,"Residential",null,null,null,"Commercial",null,null,null,"Industrial"]
[null,null,null,null,null,null,null,null,null,null,null,null,null,null,null,null,null,null,null,null,null,null,null,null,null,null,null,null,null,null,null,null,null,null,null,null,null,null,null,"LDI:"]
[null,null,null,null,null,null,null,null,null,null,null,null,null,null,null,null,null,null,null,null,null,null,null,null,null,null,null,null,null,null,null,null,null,null,null,null,null,null,null,"Land Use Source & Year:"]
[]
[null,null,"Local Watershed Erosion (select one) :",null,null,null,null,null,null,null,null,null,null,null,null," None",null,null,null," Slight",null,null,null," Moderate",null,null,null,null," Heavy",null,"Artificially Impounded"]
[]
[]
[null,null,"Local Watershed Pollution :",null,null,null,null,null,null,null,null,null,null,"None",null,null,null,null,null," Slight",null,null,null," Moderate",null,null,null,null," Heavy",null,null,null," Yes",null,null,null," No"]
[]
[null,"HABITAT COMPONENTS",null,null,null,null,null,null,null,null,null,null,"OPTIMAL",null,null,null,null,null,null,null,null,"SUBOPTIMAL",null,null,null,null,null,null,null,null,null,"MARGINAL",null,null,null,null,null,null,null,null,null,"POOR"]
[null,null,"STORMWATER INPUTS",null,null,null,null,null,null,"Stormwater enters system via sheet flow over non-cultivated and/or natural vegetation",null,null,null,null,null,null,null,null,null,"Some direct stormwater inputs (ditches, pipes, cultivated vegetation < 10%) \nbut good BMPs in place",null,null,null,null,null,null,null,null,null,"Moderate direct inputs of stormwater (ditches, pipes, cultivated vegetation 11%-50%) but few BMPs in place",null,null,null,null,null,null,null,null,null,"Much direct input of stormwater (ditches, pipes, cultivated vegetation > 51%) and no or ineffective BMPs in place"]
[null,null,"Enter score below based on scale to right"]
[]
[null,null,null,2,null,null,null,null,null,20,null,19,null,18,null,17,null,16,null,15,null,14,null,13,null,12,null,11,null,10,null,9,null,8,null,7,null,6,null,5,null,4,null,3,null,2,null,1]
[null,null,"LAKESIDE ALTERATIONS",null,null,null,null,null,null,"Very few man-made structures, roads, or other disturbance adjacent to lake \n(<10% lakeside affected)",null,null,null,null,null,null,null,null,null,"Moderate disturbance visible -structures, roads or other \n(10%-49% lakeside affected)",null,null,null,null,null,null,null,null,null,"Many structures, roads or other human disturbance visible \n(50%-70% lakeside affected)",null,null,null,null,null,null,null,null,null,"Highly developed or disturbed (>70% of lakeside affected)"]
[null,null,"Enter score below based on scale to right"]
[]
[null,null,null,7,null,null,null,null,null,20,null,19,null,18,null,17,null,16,null,15,null,14,null,13,null,12,null,11,null,10,null,9,null,8,null,7,null,6,null,5,null,4,null,3,null,2,null,1]
[null,null,"BUFFER ZONE",null,null,null,null,null,null,"Expected native vegetation between uplands and littoral zone, greater than 90% of shore \nwith >18 m buffer",null,null,null,null,null,null,null,null,null,"89%-51% of shoreline with \n>18m buffer or >75% \nwith 10m to 18m buffer",null,null,null,null,null,null,null,null,null,"50%-30% of shoreline with >18m buffer or 50%-74% \nwith 10m to 18m buffer",null,null,null,null,null,null,null,null,null,"< 29% of shoreline \nwith >18m buffer"]
[null,null,"Enter score below based on scale to right"]
[]
[null,null,null,9,null,null,null,null,null,20,null,19,null,18,null,17,null,16,null,15,null,14,null,13,null,12,null,11,null,10,null,9,null,8,null,7,null,6,null,5,null,4,null,3,null,2,null,1]
[null,null,"WATER / SUBSTRATE / BIOLOGICAL:  SAMPLES AND OBSERVATIONS"]
[]
[null,null,"Water:",null,null,null,null,null,null,null,null,null,null,null,null,null,null,null,null,null,null,null,null,null,null,null,null,null,null,null,null,"Water Odors:",null,null,null,null,null,null,null," Normal"]
[null,null,null,"Nutrient Sample Taken? ",null,null,null,null,null,null,null,null,null," Yes ",null,null,null," No ",null,null,"Preserved?",null,null,null,null," Yes",null,null,null," No ",null,null,null," Normal",null,null,null," Petroleum",null,null,null,"Other:"]
[]
[null,null,null,"Color Sample Taken? ",null,null,null,null,null,null,null,null,null," Yes ",null,null,null," No ",null,null,"Lot#",null,null,null,null,null,null,null,null," pH<2"]
[]
[null,null,null,"Alkalinity Sample Taken? ",null,null,null,null,null,null,null,null,null," Yes ",null,null,null," No ",null,null,"Exp. Date:",null,null,null,null,null,null,null,null,null,null,"Water Surface Oils:",null,null,null,null,null,null,null," Normal"]
[]
[null,null,null,"Water Level ",null,null,null,null,null,null,null,null,null," Low  ",null,null,null," Normal  ",null,null,null," High  ",null,null,null,null,null,null,null,null,null,null,null," Sheen/Slick",null,null,null,null," Glob",null,null,"Other:"]
[]
[]
[null,null,"Meter",null,null,null,"Sample Depth",null,null,null,"Temp",null,null,"pH",null,null,"D.O",null,"D.O Sat.",null,null,null,"Sp. Cond.",null,null,"Salinity",null,null,null,null,null,"Water Clarity:",null,null,null,null,null," Clear",null,null,"  Water Color:",null,null,null,null,null," Clear"]
[null,null,"Readings:",null,null,null,null,"m",null,null,"(°C)",null,null,"(SU)",null,null,"(mg/L)",null,null,"(%)",null,"(µMho/cm)",null,null,null,"(ppt)"]
[null,null,"Data J Qualified?"]
[]
[null,null,"Top:",null,null,null,null,null,null,null,null,null,null,null,null,null,null,null,null,null,null,null,null,null,null,null,null,null,null,null,null,null,null," Opaque",null,null,null," Turbid",null,null,null,null," Tannic",null,null,null," Green (Algae)"]
[]
[null,null,"Mid-Depth:",null,null,null,null,null,null,null,null,null,null,null,null,null,null,null,null,null,null,null,null,null,null,null,null,null,null,null,null,null,null," Slightly Turbid"]
[]
[null,null,null,null,null,null,null,null,null,null,null,null,null,null,null,null,null,null,null,null,null,null,null,null,null,null,null,null,null,null,null,"SECCHI DEPTH (M)",null,null,null,null,null,null,null,null,"TOTAL DEPTH (M)"]
[null,null,"Bottom:"]
[]
[null,null,"Meter ID:",null,null,null,null,null,null,null,null,null,null,null,null,null,null,null,null,null,null,null,null,null,null,null,null,null,null,null,null," VOB",null,null,null,null,null,null,null,null,"PHOTOS TAKEN?"]
[null,null,null,null,null,null,null,null,null,null,null,null,null,null,null,null,null,null,null,null,null,null,null,null,null,null,null,null,null,null,null,null,null,null,null,null,"Yes",null,null,"No",null,null,null,null,null,"Yes",null,null,"No"]
[]
[null,null,"Sediment Type:",null,null,null,null,null,null,null,null,null,null,null,null,null,null,null,null,null,null,null,null,null,null,null,null,null,null,null,null,"Sediment Odors: "]
[null,null,null,null,null,null,null,null,null,null,null,null,null,null,null,null,null,null," Sample Taken?",null,null,null,null,null,null," Yes",null,null,null," No"]
[null,null,null," Sandy",null,null,null," Organic fibrous (peaty)",null,null,null,null,null,null,null,null,null,null," Vegetated",null,null,null,null,null,null,null,null,null,null,null,null,null,null," Normal",null,null,null,null,"Chemical",null,null,null,null,null,"Sewage"]
[]
[null,null,null," Sandy/Silt",null,null,null," Organic smooth (muck)",null,null,null,null,null,null,null,null,null,null," Other (Specify):",null,null,null,null,null,null,null,null,null,null,null,null,null,null," Anaerobic ",null,null,null,null,"Petroleum"]
[]
[null,null,"Sediment  Oils:",null,null,null,null,null,null,null,null,null,null,null,null,null,null,null,null,null,null,null,null,null,null,null,null,null,null,null,null,"Water Level Control Mechanisms Present (Weir, Dam, Pumps) :"]
[]
[null,null,null,"Normal",null,null,null,"Glob",null,null,null,null,null,null,null,null,null,null,"Slick"]
[]
[null,null,null,"Sheen",null,null,null," Organic smooth (muck)",null,null,null,null,null,null,null,null,null,null," Other (Specify):",null,null,null,null,null,null,null,null,null,null,null,null,null,null,"Yes",null,null,null,null,"No",null,null,null,null,null,"Don't know"]
[]
[null,null,"Biological Communities:",null,null,null,null,null,null,null,null,null,null,null,null,null,null,null,null,null,null," Abundance:",null,null,null,null,null,null,null,null,null,null,null,null,null,null,null," Additional Notes:"]
[]
[null,null,"LVI Conducted?",null,null,null,null,null,null,null,null,null,null,null,null,null," Yes",null,null," No",null,null,null,null,null,null,null,"Absent",null,null,"Rare","Common",null,null,"Abundant"]
[null,null,null,null,null,null,null,null,null,null,null,null,null,null,null,null,null,null,null,null,null,"Periphyton/Algal mat"]
[null,null,"Phytoplankton Sample Taken?",null,null,null,null,null,null,null,null,null,null,null,null,null," Yes",null,null," No"]
[null,null,null,null,null,null,null,null,null,null,null,null,null,null,null,null,null,null,null,null,null,"Nuisance Plants"]
[null,null,"Sampled Preserved?",null,null,null,null,null,null,null,null,null,null,null,null,null," Yes",null,null," No"]
[null,null,null,null,null,null,null,null,null,null,null,null,null,null,null,null,null,null,null,null,null,"Submersed Plants"]
[null,null,"Lot#:",null,null,null,null,null,null,null,null,"Exp Date:"]
[null,null,null,null,null,null,null,null,null,null,null,null,null,null,null,null,null,null,null,null,null,"Exotic Apple Snails"]
[null,null,"Algal Bloom/Algal ID Sample Taken?",null,null,null,null,null,null,null,null,null,null,null,null,null," Yes",null,null," No"]
[]
[null,null,"Active Vegetation Mgmt?",null,null,null,null,null,null,null,null,null," Yes",null,null," No",null,null," Don't Know"]
[]
[null,"Weather Conditions:"]
[]
[null,null,"Sampling Team:",null,null,null,null,null,{"$f":"IF('Site Info'!B17=\"\",\"-\",'Site Info'!B17)&\", \"&IF('Site Info'!B18=\"\",\"\",'Site Info'!B18)","v":"Test Testerson, "},null,null,null,null,null,null,null,null,null,null,null,null,null,null,null,null,null,null,null,null,null,null,null,null,null,null,null,null,"Date:",null,null,{"$f":"F5","v":"2025-07-29"}]

{"sheet":"5. Lake HA","index":6,"n_rows":34,"n_cols":24,"rows_kept":34,"cut":false,"hidden":false,"merged":[[32,1,32,2],[32,3,32,13],[33,1,33,2],[33,3,33,13],[28,1,28,2],[28,3,28,4],[25,14,25,18],[30,3,31,4],[30,5,31,23],[29,1,29,2],[29,3,29,8],[29,9,29,13],[29,14,29,18],[29,19,29,23],[25,19,25,23],[26,1,26,2],[26,3,26,4],[27,1,27,2],[27,3,27,23],[24,1,24,2],[24,3,24,4],[25,1,25,2],[25,3,25,8],[25,9,25,13],[21,19,21,23],[22,1,22,2],[22,3,22,4],[23,1,23,2],[23,3,23,8],[23,9,23,13],[23,14,23,18],[23,19,23,23],[21,14,21,18],[20,1,20,2],[20,3,20,4],[21,1,21,2],[21,3,21,8],[21,9,21,13],[17,14,17,18],[17,19,17,23],[18,1,18,2],[18,3,18,4],[19,1,19,2],[19,3,19,8],[19,9,19,13],[19,14,19,18],[19,19,19,23],[17,9,17,13],[15,1,15,2],[15,3,15,8],[16,1,16,2],[17,1,17,2],[17,3,17,8],[11,1,13,2],[11,3,12,8],[11,9,12,13],[11,14,12,18],[11,19,12,23],[13,3,13,8],[13,9,13,13],[13,14,13,18],[13,19,13,23],[14,1,14,2],[14,3,14,8],[14,9,14,13],[14,14,14,18],[14,19,14,23],[6,1,6,2],[6,3,6,8],[6,9,6,13],[6,19,6,23],[7,1,10,2],[7,3,9,8],[7,9,9,13],[7,14,9,18],[7,19,9,23],[6,14,6,18],[4,1,4,2],[4,3,4,8],[4,9,4,18],[4,19,4,23],[5,1,5,2],[5,3,5,4],[5,5,5,8],[5,9,5,12],[5,13,5,18],[5,19,5,20],[5,21,5,23],[1,1,1,23],[2,1,2,23],[3,1,3,2],[3,3,3,8],[3,9,3,18],[3,19,3,23]]}
[]
[null,"Lake Habitat Assessment"]
[null,"DEP Form FD 9000-6: Lake Habitat Assessment Field Sheet "]
[null,"WIN Station ID:",null,"Date",null,null,null,null,null,"Lake Name",null,null,null,null,null,null,null,null,null,"Field ID"]
[null,{"$f":"'Site Info'!B4&\" \"&'Site Info'!B5","v":"21FLA 21020065"},null,{"$f":"'Site Info'!B16","v":"00:00:00"},null,null,null,null,null,{"$f":"IF('Site Info'!B2=\"\",\"-\",'Site Info'!B2)","v":"Low Lake"},null,null,null,null,null,null,null,null,null,{"$f":"'Site Info'!B7","v":0}]
[null,"Eco-Region:",null,"County:",null,{"$f":"'Site Info'!B8","v":"Dixie"},null,null,null,"Sampling Location/Description:",null,null,null,{"$f":"'Site Info'!B6","v":"LOWREF"},null,null,null,null,null,"Lake Size:",null,{"$f":"'Site Info'!B10&\" \"&'Site Info'!B11","v":" "}]
[null,{"$f":"'Site Info'!B24","v":0},null,"No surface inflow or outflow present, very long water residence time, groundwater seepage dominates",null,null,null,null,null,"Surface water inflow present, but flow is rare, moderate to long water residence time",null,null,null,null,"Surface water inflow and outflow present (or outflow only), sometimes with visible flow, short water residence time",null,null,null,null,"Impounded, hydrology of system artificially controlled"]
[null,"Hydrology"]
[]
[]
[]
[null,"Color",null,"Very clear, uncolored water (benthic sampling appropriate)",null,null,null,null,null,"Water somewhat tannin stained (benthic sampling appropriate)",null,null,null,null,"Dark, discolored water (water color 20 PCU or higher)",null,null,null,null,"Visibility extremely reduced due to high color"]
[]
[]
[null,null,null,"Optimal",null,null,null,null,null,"Suboptimal",null,null,null,null,"Marginal",null,null,null,null,"Poor"]
[null,"Secchi",null,"Secchi >3 m                                              Secchi(m)",null,null,null,null,null,3,2.6,2.2000000000000002,1.8,1.4,1,0.9,0.8,0.7,0.6,0.5,0.4,0.3,0.2,0.1]
[null,15,null,"VOB",20,19,18,17,16,15,14,13,12,11,10,9,8,7,6,5,4,3,2,1]
[null,"Vegetation Quality\nEnter score below based on scale to right",null,"Diverse, expected native vegetation (emergent or submersed), less than 5% nuisance taxa",null,null,null,null,null,"Mostly expected native plants, but moderate growths (6%-20% of lake) of nuisance macrophytes, or more than 50% of lake covered with plants",null,null,null,null,"Large masses (21%- 40%) of nuisance macrophytes (e.g., Hydrilla, hyacinth, cattail, etc.) or algal mats",null,null,null,null,"Lake choked (>40%) with nuisance macrophytes (duck-weed, hyacinth, etc.) or algal mats, or few plants present at all (e.g., plants removed)"]
[null,10,null,20,null,19,18,17,16,15,14,13,12,11,10,9,8,7,6,5,4,3,2,1]
[null,"Stormwater Inputs\nEnter score below based on scale to right",null,"Stormwater enters system via sheet flow over non-cultivated and/or natural vegetation",null,null,null,null,null,"Some direct stormwater inputs (ditches, pipes, cultivated vegetation < 10%) but good BMPs in place",null,null,null,null,"Moderate direct inputs of stormwater (ditches, pipes, cultivated vegetation 11%-50%) but few BMPs in place",null,null,null,null,"Much direct input of stormwater (ditches, pipes, cultivated vegetation > 51%) and no or ineffective BMPs in place"]
[null,7,null,20,null,19,18,17,16,15,14,13,12,11,10,9,8,7,6,5,4,3,2,1]
[null,"Bottom Substrate Quality\nEnter score below based on scale to right",null,"Diverse mixture of sand, detritus, with small amounts of CPOM/mud/muck. SAV may be present",null,null,null,null,null,"Mixture of sand or clay and detritus with higher % CPOM/mud/muck content.  SAV may be present",null,null,null,null,"Moderate layer of CPOM/mud/muck, or hardpacked sand only, or moderate algal growth (mats or Chara) on bottom",null,null,null,null,"Thick deposits of CPOM, or fine detritus and anaerobic muck/mud/silt, or algal growth or nuisance plants (Hydrilla) cover bottom"]
[null,8,null,20,null,19,18,17,16,15,14,13,12,11,10,9,8,7,6,5,4,3,2,1]
[null,"Lakeside Adverse Human Alternations\nEnter score below based on scale to right",null,"Very few man-made structures, roads, or other disturbance adjacent to lake (<10%)",null,null,null,null,null,"Moderate disturbance visible (structures, roads or other), 10%-49% lakeside affected",null,null,null,null,"Many structures, roads or other human disturbance visible (50%-70%) lakeside affected)",null,null,null,null,"Highly developed or disturbed (>70% of lakeside affected)"]
[null,10,null,20,null,19,18,17,16,15,14,13,12,11,10,9,8,7,6,5,4,3,2,1]
[null,"Upland Buffer Zone\nEnter score below based on scale to right",null,"Expected native vegetation between uplands and littoral zone, greater than 90% of shore with >18 m buffer",null,null,null,null,null,"89%-51% of shoreline with >18m buffer or >75% with 10m to 18m buffer",null,null,null,null,"50%-30% of shoreline with >18m buffer or 50%-74% with 10m to 18m buffer",null,null,null,null,"< 29% of shoreline with >18m buffer"]
[null,10,null,20,null,19,18,17,16,15,14,13,12,11,10,9,8,7,6,5,4,3,2,1]
[null,"Adverse Watershed Land Use\nEnter score below based on scale to right",null,"Score the potential effects from adverse human land uses, based on a continuum of amount and type, with least to most adverse as follows: Native vegetation, Silviculture, Pasture or Citrus, Low Density Residential, Row Crops, Commercial, High Density Residential, Urban, Industrial"]
[null,8,null,20,null,19,18,17,16,15,14,13,12,11,10,9,8,7,6,5,4,3,2,1]
[]
[null,"Total Score","Score Category","Comments:"]
[null,{"$f":"IF(B17=\"VOB\",(SUM(B29,B27,B25,B23,B21,B19)+20),SUM(B17,B19,B21,B23,B25,B27,B29))","v":68},{"$f":"IF(B32=0,\"-\",IF(B32<35,\"Poor\",IF(B32<70,\"Marginal\",IF(B32<105,\"Suboptimal\",\"Optimal\"))))","v":"Marginal"}]
[null,"Analysis date:",null,"Analyst(s):"]
[null,{"$f":"'Site Info'!B16","v":"00:00:00"},null,{"$f":"IF('Site Info'!B17=\"\",\"-\",'Site Info'!B17)&\", \"&IF('Site Info'!B18=\"\",\"\",'Site Info'!B18)","v":"Test Testerson, "}]

{"sheet":"6.Dominat Taxa Photos","index":7,"n_rows":12,"n_cols":3,"rows_kept":12,"cut":false,"hidden":false,"merged":[[2,0,3,0],[5,0,6,0],[8,0,9,0],[11,0,12,0],[0,0,0,2]]}
["FDEP SOP LVI 1100 3.2.8: Collect specimens of dominant and co-dominant taxa from groups which typically require further examination for identification  (e.g. grasses, submersed plants, “look-alike” species) for verification in the laboratory or by an independent taxonomist.  Take photos of dominant and co-dominant taxa which are easily identified and frequently encountered (e.g.Taxodium spp., Nymphaea odorata) and verify the ID; these do not need to be collected for verification."]
["Lake Section","Dominant/Co-dominant Taxa","Co-dominant Taxa"]
[{"$f":"'LVI Calculator'!B15","v":"Segment 1"},{"$f":"_xlfn.XLOOKUP(\"d\",'LVI Calculator'!$B$16:$B$2000,'LVI Calculator'!$A$16:$A$2000,_xlfn.XLOOKUP(\"c\",'LVI Calculator'!$B$16:$B$2000,'LVI Calculator'!$A$16:$A$2000,\"Dominant Taxa Not Identified\"))","v":"Eichhornia crassipes"},{"$f":"_xlfn.XLOOKUP(\"c\",'LVI Calculator'!$B$16:$B$2000,'LVI Calculator'!$A$16:$A$2000,\"No Co-Dominant Taxa Found\",0,-1)","v":"No Co-Dominant Taxa Found"}]
[]
[]
[{"$f":"'LVI Calculator'!C15","v":"Segment 4"},{"$f":"_xlfn.XLOOKUP(\"d\",'LVI Calculator'!$C$16:$C$2000,'LVI Calculator'!$A$16:$A$2000,_xlfn.XLOOKUP(\"c\",'LVI Calculator'!$C$16:$C$2000,'LVI Calculator'!$A$16:$A$2000,\"Dominant Taxa Not Identified\"))","v":"Eichhornia crassipes"},{"$f":"_xlfn.XLOOKUP(\"c\",'LVI Calculator'!$C$16:$C$2000,'LVI Calculator'!$A$16:$A$2000,\"No Co-Dominant Taxa Found\",0,-1)","v":"No Co-Dominant Taxa Found"}]
[]
[]
[{"$f":"'LVI Calculator'!D15","v":"Segment 7"},{"$f":"_xlfn.XLOOKUP(\"d\",'LVI Calculator'!$D$16:$D$2000,'LVI Calculator'!$A$16:$A$2000,_xlfn.XLOOKUP(\"c\",'LVI Calculator'!$D$16:$D$2000,'LVI Calculator'!$A$16:$A$2000,\"Dominant Taxa Not Identified\"))","v":"Eichhornia crassipes"},{"$f":"_xlfn.XLOOKUP(\"c\",'LVI Calculator'!$D$16:$D$2000,'LVI Calculator'!$A$16:$A$2000,\"No Co-Dominant Taxa Entered\",0,-1)","v":"No Co-Dominant Taxa Entered"}]
[]
[]
[{"$f":"'LVI Calculator'!E15","v":"Segment 10"},{"$f":"_xlfn.XLOOKUP(\"d\",'LVI Calculator'!$E$16:$E$2000,'LVI Calculator'!$A$16:$A$2000,_xlfn.XLOOKUP(\"c\",'LVI Calculator'!$E$16:$E$2000,'LVI Calculator'!$A$16:$A$2000,\"Dominant Taxa Not Identified\"))","v":"Eichhornia crassipes"},{"$f":"_xlfn.XLOOKUP(\"c\",'LVI Calculator'!$E$16:$E$2000,'LVI Calculator'!$A$16:$A$2000,\"No Co-Dominant Taxa Found\",0,-1)","v":"No Co-Dominant Taxa Found"}]

{"sheet":"7.ExtenalBioFormat","index":8,"n_rows":9,"n_cols":16,"rows_kept":9,"cut":false,"hidden":false,"merged":[[4,5,4,14],[4,0,4,3]]}
["WIN ORGANIZATION ID","WIN STATION NUMBER","STATION NAME","STATION DESCRIPTION","PRIMARY TYPE","WATERBODY NAME","LATITUDE","LONGITUDE","SAMPLE DATE","METRIC","RESULT","FIELD COMMENT","COLLECTOR","METRIC PROFICIENCY","SAMPLING ENTITY","LAB NAME"]
[{"$f":"'Site Info'!B4","v":"21FLA"},{"$f":"'Site Info'!B5","v":21020065},{"$f":"'Site Info'!B7","v":0},{"$f":"'Site Info'!B8","v":"Dixie"},"Lake",{"$f":"'Site Info'!B2","v":"Low Lake"},{"$f":"'Site Info'!B13","v":30.221693999999999},{"$f":"'Site Info'!B12","v":-82.836305999999993},{"$f":"'Site Info'!$B$15","v":"2025-07-29"},"Habitat Assessment Score",{"$f":"'5. Lake HA'!B32","v":68},{"$f":"'5. Lake HA'!F31","v":0},{"$f":"IF('Site Info'!B17=0,\"-\",'Site Info'!B17&\" & \"&'Site Info'!B18)","v":"Test Testerson & "},"N/A",{"$f":"'Site Info'!B3","v":"Northeast District Biologists"},"na"]
[{"$f":"'Site Info'!B4","v":"21FLA"},{"$f":"'Site Info'!B5","v":21020065},{"$f":"'Site Info'!B7","v":0},{"$f":"'Site Info'!B8","v":"Dixie"},"Lake",{"$f":"'Site Info'!B2","v":"Low Lake"},{"$f":"'Site Info'!B13","v":30.221693999999999},{"$f":"'Site Info'!B12","v":-82.836305999999993},{"$f":"'Site Info'!$B$15","v":"2025-07-29"},"LVI_2012_Avg",{"$f":"'LVI Calculator'!J11","v":40.720776548402441},{"$f":"'LVI Calculator'!K3","v":0},{"$f":"IF('Site Info'!B17=0,\"-\",'Site Info'!B17&\" & \"&'Site Info'!B18)","v":"Test Testerson & "},{"$f":"IF(OR('Site Info'!C17=TRUE,'Site Info'!C18=TRUE),\"Yes\")","v":"Yes"},{"$f":"'Site Info'!B3","v":"Northeast District Biologists"},"na"]
[]
["↑ All values above are auto populated from the values entered or calculated on the other worksheets.\n\nThere is no need to enter\nanything on this sheet!",null,null,null,null,"Submitting Bioassessment Data\nData providers who would like to submit LVI data to help support the Department's Impaired Waters assessment can copy the auto calculated values in this worksheet into the Watershed Assessment Sections Bioassessment Data Template.\n\nThe department is requesting external data providers who would like to submit applicable bioassessment data to help support the department's Impaired Waters assessment. Please download and complete the Bioassessment Data Template, available as a Microsoft Excel worksheet (.xlsx). Once the template has been completed with the required information, please submit the worksheet and any supporting documentation (field sheets, photos, etc.) by email to Jessica Mostyn.​​​​​​​​​​​​\n\nEntities submitting data to DEP must meet the applicable bioassessment proficiency demonstrations set forth on the Bioassessment Training, Evaluation and Quality Assurance Web Page, follow the department's Quality Assurance requirements for field activities as codified in Chapter 62-160, Florida Administrative Code (F.A.C.), and the incorporated DEP Standard Operating Procedures.  For external bioassessment data to be considered as part of the assessment, data providers must be in the applicable Active status for LVI, BioRecon, SCI and/or Habitat Assessment certification at the time of sample collection.  While the online RPS and LVS tests are not required, because there are currently no certifications for these methods, taking the online tests are highly recommended to show proficiency."]
[null,null,null,null,null,"References"]
[null,null,null,null,null,"Bioassessment Data Template","http://publicfiles.dep.state.fl.us/DEAR/DEARweb/WAS/Bio_Data_Template_2.0.xlsx"]
[null,null,null,null,null,"Jessica Mostyn","Jessica.Mostyn@dep.state.fl.us"]
[null,null,null,"Bioassessment Training, Evaluation and Quality Assurance Web Page:",null,null,"https://floridadep.gov/dear/bioassessment/content/bioassessment-training-evaluation-and-quality-assurance"]